diff options
Diffstat (limited to 'gcc/laplace.SCHWINGE/log_test')
-rw-r--r-- | gcc/laplace.SCHWINGE/log_test | 518 |
1 files changed, 258 insertions, 260 deletions
diff --git a/gcc/laplace.SCHWINGE/log_test b/gcc/laplace.SCHWINGE/log_test index 42a60130..50ffc2be 100644 --- a/gcc/laplace.SCHWINGE/log_test +++ b/gcc/laplace.SCHWINGE/log_test @@ -109,7 +109,7 @@ Fixed: tinfo.h Fixed: types/vxTypesBase.h Fixed: unistd.h math.h [...]/hurd/master/fixincludes/tests/base/math.h differ: char 1529, line 76 -*** math.h Tue Apr 19 19:59:52 2016 +*** math.h Thu May 19 12:27:40 2016 --- [...]/hurd/master/fixincludes/tests/base/math.h Mon Dec 10 23:37:58 2012 *************** *** 73,78 **** @@ -122,7 +122,7 @@ math.h [...]/hurd/master/fixincludes/tests/base/math.h differ: char 1529, line 7 #endif /* MATH_HUGE_VAL_FROM_DBL_MAX_CHECK */ reg_types.h [...]/hurd/master/fixincludes/tests/base/reg_types.h differ: char 266, line 12 -*** reg_types.h Tue Apr 19 19:59:52 2016 +*** reg_types.h Thu May 19 12:27:40 2016 --- [...]/hurd/master/fixincludes/tests/base/reg_types.h Sun May 27 02:29:29 2012 *************** *** 9,15 **** @@ -143,7 +143,7 @@ reg_types.h [...]/hurd/master/fixincludes/tests/base/reg_types.h differ: char 26 } __regex_t; extern __regex_t re; sys/stat.h [...]/hurd/master/fixincludes/tests/base/sys/stat.h differ: char 881, line 38 -*** sys/stat.h Tue Apr 19 19:59:52 2016 +*** sys/stat.h Thu May 19 12:27:40 2016 --- [...]/hurd/master/fixincludes/tests/base/sys/stat.h Mon Dec 10 23:37:58 2012 *************** *** 35,41 **** @@ -164,7 +164,7 @@ sys/stat.h [...]/hurd/master/fixincludes/tests/base/sys/stat.h differ: char 881, #include <types/vxTypesOld.h> #endif /* VXWORKS_NEEDS_VXWORKS_CHECK */ time.h [...]/hurd/master/fixincludes/tests/base/time.h differ: char 375, line 17 -*** time.h Tue Apr 19 19:59:52 2016 +*** time.h Thu May 19 12:27:40 2016 --- [...]/hurd/master/fixincludes/tests/base/time.h Sun May 27 02:29:29 2012 *************** *** 14,20 **** @@ -218,8 +218,8 @@ else \ touch ${rootme}/testsuite/gcc-parallel/finished; \ fi ; \ fi ) -Test Run By thomas on Tue Apr 19 19:59:59 2016 -Native configuration is i686-unknown-gnu0.6 +Test Run By thomas on Thu May 19 12:27:47 2016 +Native configuration is i686-unknown-gnu0.7 === gcc tests === @@ -286,8 +286,10 @@ XPASS: gcc.dg/guality/pr41353-1.c -O3 -g line 28 j == 28 + 37 XPASS: gcc.dg/guality/pr41353-1.c -Os line 28 j == 28 + 37 XPASS: gcc.dg/guality/pr41353-1.c -O2 -flto -fno-use-linker-plugin -flto-partition=none line 28 j == 28 + 37 XPASS: gcc.dg/guality/pr41353-1.c -O2 -flto -fuse-linker-plugin -fno-fat-lto-objects line 28 j == 28 + 37 +FAIL: gcc.dg/guality/pr41447-1.c -O1 execution test FAIL: gcc.dg/guality/pr41447-1.c -O2 execution test FAIL: gcc.dg/guality/pr41447-1.c -O3 -g execution test +FAIL: gcc.dg/guality/pr41447-1.c -Os execution test FAIL: gcc.dg/guality/pr41447-1.c -O2 -flto -fno-use-linker-plugin -flto-partition=none execution test FAIL: gcc.dg/guality/pr41616-1.c -O2 -flto -fuse-linker-plugin -fno-fat-lto-objects execution test FAIL: gcc.dg/guality/pr45882.c -O2 -flto -fuse-linker-plugin -fno-fat-lto-objects line 16 d == 112 @@ -464,8 +466,8 @@ skipping test framework tests, CHECK_TEST_FRAMEWORK is not defined === gcc Summary === -# of expected passes 108833 -# of unexpected failures 82 +# of expected passes 108831 +# of unexpected failures 84 # of unexpected successes 20 # of expected failures 315 # of unsupported tests 1526 @@ -496,8 +498,8 @@ else \ touch ${rootme}/testsuite/g++-parallel/finished; \ fi ; \ fi ) -Test Run By thomas on Wed Apr 20 00:20:29 2016 -Native configuration is i686-unknown-gnu0.6 +Test Run By thomas on Thu May 19 16:50:39 2016 +Native configuration is i686-unknown-gnu0.7 === g++ tests === @@ -610,8 +612,8 @@ else \ touch ${rootme}/testsuite/gfortran-parallel/finished; \ fi ; \ fi ) -Test Run By thomas on Wed Apr 20 02:52:44 2016 -Native configuration is i686-unknown-gnu0.6 +Test Run By thomas on Thu May 19 19:43:10 2016 +Native configuration is i686-unknown-gnu0.7 === gfortran tests === @@ -675,8 +677,8 @@ else \ touch ${rootme}/testsuite/objc-parallel/finished; \ fi ; \ fi ) -Test Run By thomas on Wed Apr 20 04:47:38 2016 -Native configuration is i686-unknown-gnu0.6 +Test Run By thomas on Thu May 19 21:38:58 2016 +Native configuration is i686-unknown-gnu0.7 === objc tests === @@ -720,12 +722,12 @@ make[2]: Entering directory '[...]/hurd/master.build/libbacktrace' true DO=all multi-do # make make btest stest make[3]: Entering directory '[...]/hurd/master.build/libbacktrace' -[...]/hurd/master.build/./prev-gcc/xgcc -B[...]/hurd/master.build/./prev-gcc/ -B[...]/hurd/master.build.install/i686-unknown-gnu0.6/bin/ -B[...]/hurd/master.build.install/i686-unknown-gnu0.6/bin/ -B[...]/hurd/master.build.install/i686-unknown-gnu0.6/lib/ -isystem [...]/hurd/master.build.install/i686-unknown-gnu0.6/include -isystem [...]/hurd/master.build.install/i686-unknown-gnu0.6/sys-include -DHAVE_CONFIG_H -I. -I../../master/libbacktrace -I ../../master/libbacktrace/../include -I ../../master/libbacktrace/../libgcc -I ../libgcc -funwind-tables -frandom-seed=btest-btest.o -W -Wall -Wwrite-strings -Wstrict-prototypes -Wmissing-prototypes -Wold-style-definition -Wmissing-format-attribute -Wcast-qual -g -O -g -O2 -c -o btest-btest.o `test -f 'btest.c' || echo '../../master/libbacktrace/'`btest.c -/bin/dash ./libtool --tag=CC --mode=link [...]/hurd/master.build/./prev-gcc/xgcc -B[...]/hurd/master.build/./prev-gcc/ -B[...]/hurd/master.build.install/i686-unknown-gnu0.6/bin/ -B[...]/hurd/master.build.install/i686-unknown-gnu0.6/bin/ -B[...]/hurd/master.build.install/i686-unknown-gnu0.6/lib/ -isystem [...]/hurd/master.build.install/i686-unknown-gnu0.6/include -isystem [...]/hurd/master.build.install/i686-unknown-gnu0.6/sys-include -funwind-tables -frandom-seed=btest -W -Wall -Wwrite-strings -Wstrict-prototypes -Wmissing-prototypes -Wold-style-definition -Wmissing-format-attribute -Wcast-qual -g -O -g -O2 -static-libstdc++ -static-libgcc -o btest btest-btest.o libbacktrace.la -libtool: link: [...]/hurd/master.build/./prev-gcc/xgcc -B[...]/hurd/master.build/./prev-gcc/ -B[...]/hurd/master.build.install/i686-unknown-gnu0.6/bin/ -B[...]/hurd/master.build.install/i686-unknown-gnu0.6/bin/ -B[...]/hurd/master.build.install/i686-unknown-gnu0.6/lib/ -isystem [...]/hurd/master.build.install/i686-unknown-gnu0.6/include -isystem [...]/hurd/master.build.install/i686-unknown-gnu0.6/sys-include -funwind-tables -frandom-seed=btest -W -Wall -Wwrite-strings -Wstrict-prototypes -Wmissing-prototypes -Wold-style-definition -Wmissing-format-attribute -Wcast-qual -g -O -g -O2 -static-libstdc++ -static-libgcc -o btest btest-btest.o ./.libs/libbacktrace.a -[...]/hurd/master.build/./prev-gcc/xgcc -B[...]/hurd/master.build/./prev-gcc/ -B[...]/hurd/master.build.install/i686-unknown-gnu0.6/bin/ -B[...]/hurd/master.build.install/i686-unknown-gnu0.6/bin/ -B[...]/hurd/master.build.install/i686-unknown-gnu0.6/lib/ -isystem [...]/hurd/master.build.install/i686-unknown-gnu0.6/include -isystem [...]/hurd/master.build.install/i686-unknown-gnu0.6/sys-include -DHAVE_CONFIG_H -I. -I../../master/libbacktrace -I ../../master/libbacktrace/../include -I ../../master/libbacktrace/../libgcc -I ../libgcc -funwind-tables -frandom-seed=stest.o -W -Wall -Wwrite-strings -Wstrict-prototypes -Wmissing-prototypes -Wold-style-definition -Wmissing-format-attribute -Wcast-qual -g -O2 -c ../../master/libbacktrace/stest.c -/bin/dash ./libtool --tag=CC --mode=link [...]/hurd/master.build/./prev-gcc/xgcc -B[...]/hurd/master.build/./prev-gcc/ -B[...]/hurd/master.build.install/i686-unknown-gnu0.6/bin/ -B[...]/hurd/master.build.install/i686-unknown-gnu0.6/bin/ -B[...]/hurd/master.build.install/i686-unknown-gnu0.6/lib/ -isystem [...]/hurd/master.build.install/i686-unknown-gnu0.6/include -isystem [...]/hurd/master.build.install/i686-unknown-gnu0.6/sys-include -funwind-tables -frandom-seed=stest -W -Wall -Wwrite-strings -Wstrict-prototypes -Wmissing-prototypes -Wold-style-definition -Wmissing-format-attribute -Wcast-qual -g -O2 -static-libstdc++ -static-libgcc -o stest stest.o libbacktrace.la -libtool: link: [...]/hurd/master.build/./prev-gcc/xgcc -B[...]/hurd/master.build/./prev-gcc/ -B[...]/hurd/master.build.install/i686-unknown-gnu0.6/bin/ -B[...]/hurd/master.build.install/i686-unknown-gnu0.6/bin/ -B[...]/hurd/master.build.install/i686-unknown-gnu0.6/lib/ -isystem [...]/hurd/master.build.install/i686-unknown-gnu0.6/include -isystem [...]/hurd/master.build.install/i686-unknown-gnu0.6/sys-include -funwind-tables -frandom-seed=stest -W -Wall -Wwrite-strings -Wstrict-prototypes -Wmissing-prototypes -Wold-style-definition -Wmissing-format-attribute -Wcast-qual -g -O2 -static-libstdc++ -static-libgcc -o stest stest.o ./.libs/libbacktrace.a +[...]/hurd/master.build/./prev-gcc/xgcc -B[...]/hurd/master.build/./prev-gcc/ -B[...]/hurd/master.build.install/i686-unknown-gnu0.7/bin/ -B[...]/hurd/master.build.install/i686-unknown-gnu0.7/bin/ -B[...]/hurd/master.build.install/i686-unknown-gnu0.7/lib/ -isystem [...]/hurd/master.build.install/i686-unknown-gnu0.7/include -isystem [...]/hurd/master.build.install/i686-unknown-gnu0.7/sys-include -DHAVE_CONFIG_H -I. -I../../master/libbacktrace -I ../../master/libbacktrace/../include -I ../../master/libbacktrace/../libgcc -I ../libgcc -funwind-tables -frandom-seed=btest-btest.o -W -Wall -Wwrite-strings -Wstrict-prototypes -Wmissing-prototypes -Wold-style-definition -Wmissing-format-attribute -Wcast-qual -g -O -g -O2 -c -o btest-btest.o `test -f 'btest.c' || echo '../../master/libbacktrace/'`btest.c +/bin/dash ./libtool --tag=CC --mode=link [...]/hurd/master.build/./prev-gcc/xgcc -B[...]/hurd/master.build/./prev-gcc/ -B[...]/hurd/master.build.install/i686-unknown-gnu0.7/bin/ -B[...]/hurd/master.build.install/i686-unknown-gnu0.7/bin/ -B[...]/hurd/master.build.install/i686-unknown-gnu0.7/lib/ -isystem [...]/hurd/master.build.install/i686-unknown-gnu0.7/include -isystem [...]/hurd/master.build.install/i686-unknown-gnu0.7/sys-include -funwind-tables -frandom-seed=btest -W -Wall -Wwrite-strings -Wstrict-prototypes -Wmissing-prototypes -Wold-style-definition -Wmissing-format-attribute -Wcast-qual -g -O -g -O2 -static-libstdc++ -static-libgcc -o btest btest-btest.o libbacktrace.la +libtool: link: [...]/hurd/master.build/./prev-gcc/xgcc -B[...]/hurd/master.build/./prev-gcc/ -B[...]/hurd/master.build.install/i686-unknown-gnu0.7/bin/ -B[...]/hurd/master.build.install/i686-unknown-gnu0.7/bin/ -B[...]/hurd/master.build.install/i686-unknown-gnu0.7/lib/ -isystem [...]/hurd/master.build.install/i686-unknown-gnu0.7/include -isystem [...]/hurd/master.build.install/i686-unknown-gnu0.7/sys-include -funwind-tables -frandom-seed=btest -W -Wall -Wwrite-strings -Wstrict-prototypes -Wmissing-prototypes -Wold-style-definition -Wmissing-format-attribute -Wcast-qual -g -O -g -O2 -static-libstdc++ -static-libgcc -o btest btest-btest.o ./.libs/libbacktrace.a +[...]/hurd/master.build/./prev-gcc/xgcc -B[...]/hurd/master.build/./prev-gcc/ -B[...]/hurd/master.build.install/i686-unknown-gnu0.7/bin/ -B[...]/hurd/master.build.install/i686-unknown-gnu0.7/bin/ -B[...]/hurd/master.build.install/i686-unknown-gnu0.7/lib/ -isystem [...]/hurd/master.build.install/i686-unknown-gnu0.7/include -isystem [...]/hurd/master.build.install/i686-unknown-gnu0.7/sys-include -DHAVE_CONFIG_H -I. -I../../master/libbacktrace -I ../../master/libbacktrace/../include -I ../../master/libbacktrace/../libgcc -I ../libgcc -funwind-tables -frandom-seed=stest.o -W -Wall -Wwrite-strings -Wstrict-prototypes -Wmissing-prototypes -Wold-style-definition -Wmissing-format-attribute -Wcast-qual -g -O2 -c ../../master/libbacktrace/stest.c +/bin/dash ./libtool --tag=CC --mode=link [...]/hurd/master.build/./prev-gcc/xgcc -B[...]/hurd/master.build/./prev-gcc/ -B[...]/hurd/master.build.install/i686-unknown-gnu0.7/bin/ -B[...]/hurd/master.build.install/i686-unknown-gnu0.7/bin/ -B[...]/hurd/master.build.install/i686-unknown-gnu0.7/lib/ -isystem [...]/hurd/master.build.install/i686-unknown-gnu0.7/include -isystem [...]/hurd/master.build.install/i686-unknown-gnu0.7/sys-include -funwind-tables -frandom-seed=stest -W -Wall -Wwrite-strings -Wstrict-prototypes -Wmissing-prototypes -Wold-style-definition -Wmissing-format-attribute -Wcast-qual -g -O2 -static-libstdc++ -static-libgcc -o stest stest.o libbacktrace.la +libtool: link: [...]/hurd/master.build/./prev-gcc/xgcc -B[...]/hurd/master.build/./prev-gcc/ -B[...]/hurd/master.build.install/i686-unknown-gnu0.7/bin/ -B[...]/hurd/master.build.install/i686-unknown-gnu0.7/bin/ -B[...]/hurd/master.build.install/i686-unknown-gnu0.7/lib/ -isystem [...]/hurd/master.build.install/i686-unknown-gnu0.7/include -isystem [...]/hurd/master.build.install/i686-unknown-gnu0.7/sys-include -funwind-tables -frandom-seed=stest -W -Wall -Wwrite-strings -Wstrict-prototypes -Wmissing-prototypes -Wold-style-definition -Wmissing-format-attribute -Wcast-qual -g -O2 -static-libstdc++ -static-libgcc -o stest stest.o ./.libs/libbacktrace.a make[3]: Leaving directory '[...]/hurd/master.build/libbacktrace' make check-TESTS make[3]: Entering directory '[...]/hurd/master.build/libbacktrace' @@ -749,16 +751,16 @@ make[2]: Nothing to be done for 'check'. make[2]: Leaving directory '[...]/hurd/master.build/libdecnumber' make[2]: Entering directory '[...]/hurd/master.build/libiberty' make[3]: Entering directory '[...]/hurd/master.build/libiberty/testsuite' -[...]/hurd/master.build/./prev-gcc/xgcc -B[...]/hurd/master.build/./prev-gcc/ -B[...]/hurd/master.build.install/i686-unknown-gnu0.6/bin/ -B[...]/hurd/master.build.install/i686-unknown-gnu0.6/bin/ -B[...]/hurd/master.build.install/i686-unknown-gnu0.6/lib/ -isystem [...]/hurd/master.build.install/i686-unknown-gnu0.6/include -isystem [...]/hurd/master.build.install/i686-unknown-gnu0.6/sys-include -DHAVE_CONFIG_H -g -O2 -static-libstdc++ -static-libgcc -I.. -I../../../master/libiberty/testsuite/../../include -o test-demangle \ +[...]/hurd/master.build/./prev-gcc/xgcc -B[...]/hurd/master.build/./prev-gcc/ -B[...]/hurd/master.build.install/i686-unknown-gnu0.7/bin/ -B[...]/hurd/master.build.install/i686-unknown-gnu0.7/bin/ -B[...]/hurd/master.build.install/i686-unknown-gnu0.7/lib/ -isystem [...]/hurd/master.build.install/i686-unknown-gnu0.7/include -isystem [...]/hurd/master.build.install/i686-unknown-gnu0.7/sys-include -DHAVE_CONFIG_H -g -O2 -static-libstdc++ -static-libgcc -I.. -I../../../master/libiberty/testsuite/../../include -o test-demangle \ ../../../master/libiberty/testsuite/test-demangle.c ../libiberty.a ./test-demangle < ../../../master/libiberty/testsuite/demangle-expected ./test-demangle: 914 tests, 0 failures ./test-demangle < ../../../master/libiberty/testsuite/d-demangle-expected ./test-demangle: 269 tests, 0 failures -[...]/hurd/master.build/./prev-gcc/xgcc -B[...]/hurd/master.build/./prev-gcc/ -B[...]/hurd/master.build.install/i686-unknown-gnu0.6/bin/ -B[...]/hurd/master.build.install/i686-unknown-gnu0.6/bin/ -B[...]/hurd/master.build.install/i686-unknown-gnu0.6/lib/ -isystem [...]/hurd/master.build.install/i686-unknown-gnu0.6/include -isystem [...]/hurd/master.build.install/i686-unknown-gnu0.6/sys-include -DHAVE_CONFIG_H -g -O2 -static-libstdc++ -static-libgcc -I.. -I../../../master/libiberty/testsuite/../../include -DHAVE_CONFIG_H -I.. -o test-pexecute \ +[...]/hurd/master.build/./prev-gcc/xgcc -B[...]/hurd/master.build/./prev-gcc/ -B[...]/hurd/master.build.install/i686-unknown-gnu0.7/bin/ -B[...]/hurd/master.build.install/i686-unknown-gnu0.7/bin/ -B[...]/hurd/master.build.install/i686-unknown-gnu0.7/lib/ -isystem [...]/hurd/master.build.install/i686-unknown-gnu0.7/include -isystem [...]/hurd/master.build.install/i686-unknown-gnu0.7/sys-include -DHAVE_CONFIG_H -g -O2 -static-libstdc++ -static-libgcc -I.. -I../../../master/libiberty/testsuite/../../include -DHAVE_CONFIG_H -I.. -o test-pexecute \ ../../../master/libiberty/testsuite/test-pexecute.c ../libiberty.a ./test-pexecute -[...]/hurd/master.build/./prev-gcc/xgcc -B[...]/hurd/master.build/./prev-gcc/ -B[...]/hurd/master.build.install/i686-unknown-gnu0.6/bin/ -B[...]/hurd/master.build.install/i686-unknown-gnu0.6/bin/ -B[...]/hurd/master.build.install/i686-unknown-gnu0.6/lib/ -isystem [...]/hurd/master.build.install/i686-unknown-gnu0.6/include -isystem [...]/hurd/master.build.install/i686-unknown-gnu0.6/sys-include -DHAVE_CONFIG_H -g -O2 -static-libstdc++ -static-libgcc -I.. -I../../../master/libiberty/testsuite/../../include -DHAVE_CONFIG_H -I.. -o test-expandargv \ +[...]/hurd/master.build/./prev-gcc/xgcc -B[...]/hurd/master.build/./prev-gcc/ -B[...]/hurd/master.build.install/i686-unknown-gnu0.7/bin/ -B[...]/hurd/master.build.install/i686-unknown-gnu0.7/bin/ -B[...]/hurd/master.build.install/i686-unknown-gnu0.7/lib/ -isystem [...]/hurd/master.build.install/i686-unknown-gnu0.7/include -isystem [...]/hurd/master.build.install/i686-unknown-gnu0.7/sys-include -DHAVE_CONFIG_H -g -O2 -static-libstdc++ -static-libgcc -I.. -I../../../master/libiberty/testsuite/../../include -DHAVE_CONFIG_H -I.. -o test-expandargv \ ../../../master/libiberty/testsuite/test-expandargv.c ../libiberty.a ./test-expandargv PASS: test-expandargv-0. @@ -768,7 +770,7 @@ PASS: test-expandargv-3. PASS: test-expandargv-4. PASS: test-expandargv-5. PASS: test-expandargv-6. -[...]/hurd/master.build/./prev-gcc/xgcc -B[...]/hurd/master.build/./prev-gcc/ -B[...]/hurd/master.build.install/i686-unknown-gnu0.6/bin/ -B[...]/hurd/master.build.install/i686-unknown-gnu0.6/bin/ -B[...]/hurd/master.build.install/i686-unknown-gnu0.6/lib/ -isystem [...]/hurd/master.build.install/i686-unknown-gnu0.6/include -isystem [...]/hurd/master.build.install/i686-unknown-gnu0.6/sys-include -DHAVE_CONFIG_H -g -O2 -static-libstdc++ -static-libgcc -I.. -I../../../master/libiberty/testsuite/../../include -DHAVE_CONFIG_H -I.. -o test-strtol \ +[...]/hurd/master.build/./prev-gcc/xgcc -B[...]/hurd/master.build/./prev-gcc/ -B[...]/hurd/master.build.install/i686-unknown-gnu0.7/bin/ -B[...]/hurd/master.build.install/i686-unknown-gnu0.7/bin/ -B[...]/hurd/master.build.install/i686-unknown-gnu0.7/lib/ -isystem [...]/hurd/master.build.install/i686-unknown-gnu0.7/include -isystem [...]/hurd/master.build.install/i686-unknown-gnu0.7/sys-include -DHAVE_CONFIG_H -g -O2 -static-libstdc++ -static-libgcc -I.. -I../../../master/libiberty/testsuite/../../include -DHAVE_CONFIG_H -I.. -o test-strtol \ ../../../master/libiberty/testsuite/test-strtol.c ../libiberty.a ./test-strtol PASS: test-strtol-0. @@ -805,56 +807,56 @@ make[3]: Entering directory '[...]/hurd/master.build/libcc1' make[3]: Leaving directory '[...]/hurd/master.build/libcc1' make[2]: Leaving directory '[...]/hurd/master.build/libcc1' make[1]: Target 'check-host' not remade because of errors. -make[2]: Entering directory '[...]/hurd/master.build/i686-unknown-gnu0.6/libstdc++-v3' +make[2]: Entering directory '[...]/hurd/master.build/i686-unknown-gnu0.7/libstdc++-v3' Making check in include -make[3]: Entering directory '[...]/hurd/master.build/i686-unknown-gnu0.6/libstdc++-v3/include' +make[3]: Entering directory '[...]/hurd/master.build/i686-unknown-gnu0.7/libstdc++-v3/include' make[3]: Nothing to be done for 'check'. -make[3]: Leaving directory '[...]/hurd/master.build/i686-unknown-gnu0.6/libstdc++-v3/include' +make[3]: Leaving directory '[...]/hurd/master.build/i686-unknown-gnu0.7/libstdc++-v3/include' Making check in libsupc++ -make[3]: Entering directory '[...]/hurd/master.build/i686-unknown-gnu0.6/libstdc++-v3/libsupc++' +make[3]: Entering directory '[...]/hurd/master.build/i686-unknown-gnu0.7/libstdc++-v3/libsupc++' make[3]: Nothing to be done for 'check'. -make[3]: Leaving directory '[...]/hurd/master.build/i686-unknown-gnu0.6/libstdc++-v3/libsupc++' +make[3]: Leaving directory '[...]/hurd/master.build/i686-unknown-gnu0.7/libstdc++-v3/libsupc++' Making check in src -make[3]: Entering directory '[...]/hurd/master.build/i686-unknown-gnu0.6/libstdc++-v3/src' +make[3]: Entering directory '[...]/hurd/master.build/i686-unknown-gnu0.7/libstdc++-v3/src' Making check in c++98 -make[4]: Entering directory '[...]/hurd/master.build/i686-unknown-gnu0.6/libstdc++-v3/src/c++98' +make[4]: Entering directory '[...]/hurd/master.build/i686-unknown-gnu0.7/libstdc++-v3/src/c++98' make[4]: Nothing to be done for 'check'. -make[4]: Leaving directory '[...]/hurd/master.build/i686-unknown-gnu0.6/libstdc++-v3/src/c++98' +make[4]: Leaving directory '[...]/hurd/master.build/i686-unknown-gnu0.7/libstdc++-v3/src/c++98' Making check in c++11 -make[4]: Entering directory '[...]/hurd/master.build/i686-unknown-gnu0.6/libstdc++-v3/src/c++11' +make[4]: Entering directory '[...]/hurd/master.build/i686-unknown-gnu0.7/libstdc++-v3/src/c++11' make[4]: Nothing to be done for 'check'. -make[4]: Leaving directory '[...]/hurd/master.build/i686-unknown-gnu0.6/libstdc++-v3/src/c++11' +make[4]: Leaving directory '[...]/hurd/master.build/i686-unknown-gnu0.7/libstdc++-v3/src/c++11' Making check in filesystem -make[4]: Entering directory '[...]/hurd/master.build/i686-unknown-gnu0.6/libstdc++-v3/src/filesystem' +make[4]: Entering directory '[...]/hurd/master.build/i686-unknown-gnu0.7/libstdc++-v3/src/filesystem' make[4]: Nothing to be done for 'check'. -make[4]: Leaving directory '[...]/hurd/master.build/i686-unknown-gnu0.6/libstdc++-v3/src/filesystem' -make[4]: Entering directory '[...]/hurd/master.build/i686-unknown-gnu0.6/libstdc++-v3/src' +make[4]: Leaving directory '[...]/hurd/master.build/i686-unknown-gnu0.7/libstdc++-v3/src/filesystem' +make[4]: Entering directory '[...]/hurd/master.build/i686-unknown-gnu0.7/libstdc++-v3/src' make[4]: Nothing to be done for 'check-am'. -make[4]: Leaving directory '[...]/hurd/master.build/i686-unknown-gnu0.6/libstdc++-v3/src' -make[3]: Leaving directory '[...]/hurd/master.build/i686-unknown-gnu0.6/libstdc++-v3/src' +make[4]: Leaving directory '[...]/hurd/master.build/i686-unknown-gnu0.7/libstdc++-v3/src' +make[3]: Leaving directory '[...]/hurd/master.build/i686-unknown-gnu0.7/libstdc++-v3/src' Making check in doc -make[3]: Entering directory '[...]/hurd/master.build/i686-unknown-gnu0.6/libstdc++-v3/doc' +make[3]: Entering directory '[...]/hurd/master.build/i686-unknown-gnu0.7/libstdc++-v3/doc' make[3]: Nothing to be done for 'check'. -make[3]: Leaving directory '[...]/hurd/master.build/i686-unknown-gnu0.6/libstdc++-v3/doc' +make[3]: Leaving directory '[...]/hurd/master.build/i686-unknown-gnu0.7/libstdc++-v3/doc' Making check in po -make[3]: Entering directory '[...]/hurd/master.build/i686-unknown-gnu0.6/libstdc++-v3/po' -/bin/dash [...]/hurd/master/libstdc++-v3/../mkinstalldirs [...]/hurd/master.build/i686-unknown-gnu0.6/libstdc++-v3/po/share/locale -mkdir -p -- [...]/hurd/master.build/i686-unknown-gnu0.6/libstdc++-v3/po/share/locale +make[3]: Entering directory '[...]/hurd/master.build/i686-unknown-gnu0.7/libstdc++-v3/po' +/bin/dash [...]/hurd/master/libstdc++-v3/../mkinstalldirs [...]/hurd/master.build/i686-unknown-gnu0.7/libstdc++-v3/po/share/locale +mkdir -p -- [...]/hurd/master.build/i686-unknown-gnu0.7/libstdc++-v3/po/share/locale catalogs='de.mo fr.mo'; \ for cat in $catalogs; do \ cat=`basename $cat`; \ lang=`echo $cat | sed 's/\.mo$//'`; \ - install_dir=[...]/hurd/master.build/i686-unknown-gnu0.6/libstdc++-v3/po/share/locale/$lang/LC_MESSAGES; \ + install_dir=[...]/hurd/master.build/i686-unknown-gnu0.7/libstdc++-v3/po/share/locale/$lang/LC_MESSAGES; \ /bin/dash [...]/hurd/master/libstdc++-v3/../mkinstalldirs $install_dir; \ /usr/bin/install -c -m 644 $cat $install_dir/libstdc++.mo; \ done -mkdir -p -- [...]/hurd/master.build/i686-unknown-gnu0.6/libstdc++-v3/po/share/locale/de/LC_MESSAGES -mkdir -p -- [...]/hurd/master.build/i686-unknown-gnu0.6/libstdc++-v3/po/share/locale/fr/LC_MESSAGES -make[3]: Leaving directory '[...]/hurd/master.build/i686-unknown-gnu0.6/libstdc++-v3/po' +mkdir -p -- [...]/hurd/master.build/i686-unknown-gnu0.7/libstdc++-v3/po/share/locale/de/LC_MESSAGES +mkdir -p -- [...]/hurd/master.build/i686-unknown-gnu0.7/libstdc++-v3/po/share/locale/fr/LC_MESSAGES +make[3]: Leaving directory '[...]/hurd/master.build/i686-unknown-gnu0.7/libstdc++-v3/po' Making check in testsuite -make[3]: Entering directory '[...]/hurd/master.build/i686-unknown-gnu0.6/libstdc++-v3/testsuite' +make[3]: Entering directory '[...]/hurd/master.build/i686-unknown-gnu0.7/libstdc++-v3/testsuite' make check-DEJAGNU -make[4]: Entering directory '[...]/hurd/master.build/i686-unknown-gnu0.6/libstdc++-v3/testsuite' +make[4]: Entering directory '[...]/hurd/master.build/i686-unknown-gnu0.7/libstdc++-v3/testsuite' Making a new site.exp file... AR="ar"; export AR; \ RANLIB="ranlib"; export RANLIB; \ @@ -895,8 +897,8 @@ if /bin/dash -c "$runtest --version" > /dev/null 2>&1; then \ else \ echo "WARNING: could not find \`runtest'" 1>&2; :;\ fi -Test Run By thomas on Wed Apr 20 04:54:14 2016 -Native configuration is i686-unknown-gnu0.6 +Test Run By thomas on Thu May 19 21:45:46 2016 +Native configuration is i686-unknown-gnu0.7 === libstdc++ tests === @@ -915,8 +917,6 @@ FAIL: 27_io/basic_filebuf/close/char/4879.cc execution test FAIL: 27_io/basic_filebuf/close/char/9964.cc execution test FAIL: 27_io/basic_filebuf/imbue/char/13171-2.cc execution test FAIL: 27_io/basic_filebuf/imbue/wchar_t/14975-2.cc execution test -WARNING: program timed out. -FAIL: 27_io/basic_filebuf/open/char/9507.cc execution test FAIL: 27_io/basic_filebuf/seekoff/char/26777.cc execution test WARNING: program timed out. FAIL: 27_io/basic_filebuf/showmanyc/char/9533-1.cc execution test @@ -939,26 +939,26 @@ Running [...]/hurd/master/libstdc++-v3/testsuite/libstdc++-xmethods/xmethods.exp === libstdc++ Summary === -# of expected passes 11202 -# of unexpected failures 19 +# of expected passes 11203 +# of unexpected failures 18 # of expected failures 67 # of unsupported tests 249 -make[4]: Leaving directory '[...]/hurd/master.build/i686-unknown-gnu0.6/libstdc++-v3/testsuite' -make[3]: Leaving directory '[...]/hurd/master.build/i686-unknown-gnu0.6/libstdc++-v3/testsuite' +make[4]: Leaving directory '[...]/hurd/master.build/i686-unknown-gnu0.7/libstdc++-v3/testsuite' +make[3]: Leaving directory '[...]/hurd/master.build/i686-unknown-gnu0.7/libstdc++-v3/testsuite' Making check in python -make[3]: Entering directory '[...]/hurd/master.build/i686-unknown-gnu0.6/libstdc++-v3/python' +make[3]: Entering directory '[...]/hurd/master.build/i686-unknown-gnu0.7/libstdc++-v3/python' make[3]: Nothing to be done for 'check'. -make[3]: Leaving directory '[...]/hurd/master.build/i686-unknown-gnu0.6/libstdc++-v3/python' -make[3]: Entering directory '[...]/hurd/master.build/i686-unknown-gnu0.6/libstdc++-v3' -make "AR_FLAGS=rc" "CC_FOR_BUILD=gcc-4.9" "CC_FOR_TARGET=[...]/hurd/master.build/./gcc/xgcc -B[...]/hurd/master.build/./gcc/" "CFLAGS=-g -O2" "CXXFLAGS=-g -O2 -D_GNU_SOURCE" "CFLAGS_FOR_BUILD=-g -O2" "CFLAGS_FOR_TARGET=-g -O2" "INSTALL=/usr/bin/install -c" "INSTALL_DATA=/usr/bin/install -c -m 644" "INSTALL_PROGRAM=/usr/bin/install -c" "INSTALL_SCRIPT=/usr/bin/install -c" "LDFLAGS=" "LIBCFLAGS=-g -O2" "LIBCFLAGS_FOR_TARGET=-g -O2" "MAKE=make" "MAKEINFO=makeinfo --split-size=5000000 --split-size=5000000 " "SHELL=/bin/dash" "RUNTESTFLAGS=" "exec_prefix=[...]/hurd/master.build.install" "infodir=[...]/hurd/master.build.install/share/info" "libdir=[...]/hurd/master.build.install/lib" "includedir=[...]/hurd/master.build.install/include" "prefix=[...]/hurd/master.build.install" "tooldir=[...]/hurd/master.build.install/i686-unknown-gnu0.6" "gxx_include_dir=[...]/hurd/master.build.install/include/c++/6.0.0" "AR=ar" "AS=[...]/hurd/master.build/./gcc/as" "LD=[...]/hurd/master.build/./gcc/collect-ld" "RANLIB=ranlib" "NM=[...]/hurd/master.build/./gcc/nm" "NM_FOR_BUILD=" "NM_FOR_TARGET=nm" "DESTDIR=" "WERROR=" DO=all multi-do # make -make[4]: Entering directory '[...]/hurd/master.build/i686-unknown-gnu0.6/libstdc++-v3' +make[3]: Leaving directory '[...]/hurd/master.build/i686-unknown-gnu0.7/libstdc++-v3/python' +make[3]: Entering directory '[...]/hurd/master.build/i686-unknown-gnu0.7/libstdc++-v3' +make "AR_FLAGS=rc" "CC_FOR_BUILD=gcc-4.9" "CC_FOR_TARGET=[...]/hurd/master.build/./gcc/xgcc -B[...]/hurd/master.build/./gcc/" "CFLAGS=-g -O2" "CXXFLAGS=-g -O2 -D_GNU_SOURCE" "CFLAGS_FOR_BUILD=-g -O2" "CFLAGS_FOR_TARGET=-g -O2" "INSTALL=/usr/bin/install -c" "INSTALL_DATA=/usr/bin/install -c -m 644" "INSTALL_PROGRAM=/usr/bin/install -c" "INSTALL_SCRIPT=/usr/bin/install -c" "LDFLAGS=" "LIBCFLAGS=-g -O2" "LIBCFLAGS_FOR_TARGET=-g -O2" "MAKE=make" "MAKEINFO=makeinfo --split-size=5000000 --split-size=5000000 " "SHELL=/bin/dash" "RUNTESTFLAGS=" "exec_prefix=[...]/hurd/master.build.install" "infodir=[...]/hurd/master.build.install/share/info" "libdir=[...]/hurd/master.build.install/lib" "includedir=[...]/hurd/master.build.install/include" "prefix=[...]/hurd/master.build.install" "tooldir=[...]/hurd/master.build.install/i686-unknown-gnu0.7" "gxx_include_dir=[...]/hurd/master.build.install/include/c++/6.0.0" "AR=ar" "AS=[...]/hurd/master.build/./gcc/as" "LD=[...]/hurd/master.build/./gcc/collect-ld" "RANLIB=ranlib" "NM=[...]/hurd/master.build/./gcc/nm" "NM_FOR_BUILD=" "NM_FOR_TARGET=nm" "DESTDIR=" "WERROR=" DO=all multi-do # make +make[4]: Entering directory '[...]/hurd/master.build/i686-unknown-gnu0.7/libstdc++-v3' if [ -z "" ]; then \ true; \ else \ rootpre=`${PWDCMD-pwd}`/; export rootpre; \ srcrootpre=`cd ../../../master/libstdc++-v3; ${PWDCMD-pwd}`/; export srcrootpre; \ lib=`echo "${rootpre}" | sed -e 's,^.*/\([^/][^/]*\)/$,\1,'`; \ - compiler="[...]/hurd/master.build/./gcc/xgcc -B[...]/hurd/master.build/./gcc/ -B[...]/hurd/master.build.install/i686-unknown-gnu0.6/bin/ -B[...]/hurd/master.build.install/i686-unknown-gnu0.6/lib/ -isystem [...]/hurd/master.build.install/i686-unknown-gnu0.6/include -isystem [...]/hurd/master.build.install/i686-unknown-gnu0.6/sys-include "; \ + compiler="[...]/hurd/master.build/./gcc/xgcc -B[...]/hurd/master.build/./gcc/ -B[...]/hurd/master.build.install/i686-unknown-gnu0.7/bin/ -B[...]/hurd/master.build.install/i686-unknown-gnu0.7/lib/ -isystem [...]/hurd/master.build.install/i686-unknown-gnu0.7/include -isystem [...]/hurd/master.build.install/i686-unknown-gnu0.7/sys-include "; \ for i in `${compiler} --print-multi-lib 2>/dev/null`; do \ dir=`echo $i | sed -e 's/;.*$//'`; \ if [ "${dir}" = "." ]; then \ @@ -966,7 +966,7 @@ else \ else \ if [ -d ../${dir}/${lib} ]; then \ flags=`echo $i | sed -e 's/^[^;]*;//' -e 's/@/ -/g'`; \ - if (cd ../${dir}/${lib}; make "AR_FLAGS=rc" "CC_FOR_BUILD=gcc-4.9" "CC_FOR_TARGET=[...]/hurd/master.build/./gcc/xgcc -B[...]/hurd/master.build/./gcc/" "CFLAGS=-g -O2" "CXXFLAGS=-g -O2 -D_GNU_SOURCE" "CFLAGS_FOR_BUILD=-g -O2" "CFLAGS_FOR_TARGET=-g -O2" "INSTALL=/usr/bin/install -c" "INSTALL_DATA=/usr/bin/install -c -m 644" "INSTALL_PROGRAM=/usr/bin/install -c" "INSTALL_SCRIPT=/usr/bin/install -c" "LDFLAGS=" "LIBCFLAGS=-g -O2" "LIBCFLAGS_FOR_TARGET=-g -O2" "MAKE=make" "MAKEINFO=makeinfo --split-size=5000000 --split-size=5000000 " "SHELL=/bin/dash" "RUNTESTFLAGS=" "exec_prefix=[...]/hurd/master.build.install" "infodir=[...]/hurd/master.build.install/share/info" "libdir=[...]/hurd/master.build.install/lib" "includedir=[...]/hurd/master.build.install/include" "prefix=[...]/hurd/master.build.install" "tooldir=[...]/hurd/master.build.install/i686-unknown-gnu0.6" "gxx_include_dir=[...]/hurd/master.build.install/include/c++/6.0.0" "AR=ar" "AS=[...]/hurd/master.build/./gcc/as" "LD=[...]/hurd/master.build/./gcc/collect-ld" "RANLIB=ranlib" "NM=[...]/hurd/master.build/./gcc/nm" "NM_FOR_BUILD=" "NM_FOR_TARGET=nm" "DESTDIR=" "WERROR=" \ + if (cd ../${dir}/${lib}; make "AR_FLAGS=rc" "CC_FOR_BUILD=gcc-4.9" "CC_FOR_TARGET=[...]/hurd/master.build/./gcc/xgcc -B[...]/hurd/master.build/./gcc/" "CFLAGS=-g -O2" "CXXFLAGS=-g -O2 -D_GNU_SOURCE" "CFLAGS_FOR_BUILD=-g -O2" "CFLAGS_FOR_TARGET=-g -O2" "INSTALL=/usr/bin/install -c" "INSTALL_DATA=/usr/bin/install -c -m 644" "INSTALL_PROGRAM=/usr/bin/install -c" "INSTALL_SCRIPT=/usr/bin/install -c" "LDFLAGS=" "LIBCFLAGS=-g -O2" "LIBCFLAGS_FOR_TARGET=-g -O2" "MAKE=make" "MAKEINFO=makeinfo --split-size=5000000 --split-size=5000000 " "SHELL=/bin/dash" "RUNTESTFLAGS=" "exec_prefix=[...]/hurd/master.build.install" "infodir=[...]/hurd/master.build.install/share/info" "libdir=[...]/hurd/master.build.install/lib" "includedir=[...]/hurd/master.build.install/include" "prefix=[...]/hurd/master.build.install" "tooldir=[...]/hurd/master.build.install/i686-unknown-gnu0.7" "gxx_include_dir=[...]/hurd/master.build.install/include/c++/6.0.0" "AR=ar" "AS=[...]/hurd/master.build/./gcc/as" "LD=[...]/hurd/master.build/./gcc/collect-ld" "RANLIB=ranlib" "NM=[...]/hurd/master.build/./gcc/nm" "NM_FOR_BUILD=" "NM_FOR_TARGET=nm" "DESTDIR=" "WERROR=" \ CFLAGS="-g -O2 ${flags}" \ CCASFLAGS=" ${flags}" \ FCFLAGS=" ${flags}" \ @@ -996,19 +996,19 @@ else \ fi; \ done; \ fi -make[4]: Leaving directory '[...]/hurd/master.build/i686-unknown-gnu0.6/libstdc++-v3' -make[3]: Leaving directory '[...]/hurd/master.build/i686-unknown-gnu0.6/libstdc++-v3' -make[2]: Leaving directory '[...]/hurd/master.build/i686-unknown-gnu0.6/libstdc++-v3' -make[2]: Entering directory '[...]/hurd/master.build/i686-unknown-gnu0.6/libssp' -make "AR_FLAGS=rc" "CC_FOR_BUILD=gcc-4.9" "CFLAGS=-g -O2" "CXXFLAGS=-g -O2 -D_GNU_SOURCE" "CFLAGS_FOR_BUILD=-g -O2" "CFLAGS_FOR_TARGET=-g -O2" "INSTALL=/usr/bin/install -c" "INSTALL_DATA=/usr/bin/install -c -m 644" "INSTALL_PROGRAM=/usr/bin/install -c" "INSTALL_SCRIPT=/usr/bin/install -c" "JC1FLAGS=" "LDFLAGS=" "LIBCFLAGS=-g -O2" "LIBCFLAGS_FOR_TARGET=-g -O2" "MAKE=make" "MAKEINFO=makeinfo --split-size=5000000 --split-size=5000000 " "PICFLAG=" "PICFLAG_FOR_TARGET=" "SHELL=/bin/dash" "RUNTESTFLAGS=" "exec_prefix=[...]/hurd/master.build.install" "infodir=[...]/hurd/master.build.install/share/info" "libdir=[...]/hurd/master.build.install/lib" "prefix=[...]/hurd/master.build.install" "includedir=[...]/hurd/master.build.install/include" "AR=ar" "AS=[...]/hurd/master.build/./gcc/as" "CC=[...]/hurd/master.build/./gcc/xgcc -B[...]/hurd/master.build/./gcc/ -B[...]/hurd/master.build.install/i686-unknown-gnu0.6/bin/ -B[...]/hurd/master.build.install/i686-unknown-gnu0.6/lib/ -isystem [...]/hurd/master.build.install/i686-unknown-gnu0.6/include -isystem [...]/hurd/master.build.install/i686-unknown-gnu0.6/sys-include " "CXX=[...]/hurd/master.build/./gcc/xg++ -B[...]/hurd/master.build/./gcc/ -nostdinc++ -nostdinc++ -I[...]/hurd/master.build/i686-unknown-gnu0.6/libstdc++-v3/include/i686-unknown-gnu0.6 -I[...]/hurd/master.build/i686-unknown-gnu0.6/libstdc++-v3/include -I[...]/hurd/master/libstdc++-v3/libsupc++ -I[...]/hurd/master/libstdc++-v3/include/backward -I[...]/hurd/master/libstdc++-v3/testsuite/util -L[...]/hurd/master.build/i686-unknown-gnu0.6/libstdc++-v3/src -L[...]/hurd/master.build/i686-unknown-gnu0.6/libstdc++-v3/src/.libs -L[...]/hurd/master.build/i686-unknown-gnu0.6/libstdc++-v3/libsupc++/.libs -B[...]/hurd/master.build/i686-unknown-gnu0.6/libstdc++-v3/src/.libs -B[...]/hurd/master.build/i686-unknown-gnu0.6/libstdc++-v3/libsupc++/.libs -B[...]/hurd/master.build.install/i686-unknown-gnu0.6/bin/ -B[...]/hurd/master.build.install/i686-unknown-gnu0.6/lib/ -isystem [...]/hurd/master.build.install/i686-unknown-gnu0.6/include -isystem [...]/hurd/master.build.install/i686-unknown-gnu0.6/sys-include " "LD=[...]/hurd/master.build/./gcc/collect-ld" "LIBCFLAGS=-g -O2" "NM=[...]/hurd/master.build/./gcc/nm" "PICFLAG=" "RANLIB=ranlib" "DESTDIR=" DO=all multi-do # make -make[3]: Entering directory '[...]/hurd/master.build/i686-unknown-gnu0.6/libssp' +make[4]: Leaving directory '[...]/hurd/master.build/i686-unknown-gnu0.7/libstdc++-v3' +make[3]: Leaving directory '[...]/hurd/master.build/i686-unknown-gnu0.7/libstdc++-v3' +make[2]: Leaving directory '[...]/hurd/master.build/i686-unknown-gnu0.7/libstdc++-v3' +make[2]: Entering directory '[...]/hurd/master.build/i686-unknown-gnu0.7/libssp' +make "AR_FLAGS=rc" "CC_FOR_BUILD=gcc-4.9" "CFLAGS=-g -O2" "CXXFLAGS=-g -O2 -D_GNU_SOURCE" "CFLAGS_FOR_BUILD=-g -O2" "CFLAGS_FOR_TARGET=-g -O2" "INSTALL=/usr/bin/install -c" "INSTALL_DATA=/usr/bin/install -c -m 644" "INSTALL_PROGRAM=/usr/bin/install -c" "INSTALL_SCRIPT=/usr/bin/install -c" "JC1FLAGS=" "LDFLAGS=" "LIBCFLAGS=-g -O2" "LIBCFLAGS_FOR_TARGET=-g -O2" "MAKE=make" "MAKEINFO=makeinfo --split-size=5000000 --split-size=5000000 " "PICFLAG=" "PICFLAG_FOR_TARGET=" "SHELL=/bin/dash" "RUNTESTFLAGS=" "exec_prefix=[...]/hurd/master.build.install" "infodir=[...]/hurd/master.build.install/share/info" "libdir=[...]/hurd/master.build.install/lib" "prefix=[...]/hurd/master.build.install" "includedir=[...]/hurd/master.build.install/include" "AR=ar" "AS=[...]/hurd/master.build/./gcc/as" "CC=[...]/hurd/master.build/./gcc/xgcc -B[...]/hurd/master.build/./gcc/ -B[...]/hurd/master.build.install/i686-unknown-gnu0.7/bin/ -B[...]/hurd/master.build.install/i686-unknown-gnu0.7/lib/ -isystem [...]/hurd/master.build.install/i686-unknown-gnu0.7/include -isystem [...]/hurd/master.build.install/i686-unknown-gnu0.7/sys-include " "CXX=[...]/hurd/master.build/./gcc/xg++ -B[...]/hurd/master.build/./gcc/ -nostdinc++ -nostdinc++ -I[...]/hurd/master.build/i686-unknown-gnu0.7/libstdc++-v3/include/i686-unknown-gnu0.7 -I[...]/hurd/master.build/i686-unknown-gnu0.7/libstdc++-v3/include -I[...]/hurd/master/libstdc++-v3/libsupc++ -I[...]/hurd/master/libstdc++-v3/include/backward -I[...]/hurd/master/libstdc++-v3/testsuite/util -L[...]/hurd/master.build/i686-unknown-gnu0.7/libstdc++-v3/src -L[...]/hurd/master.build/i686-unknown-gnu0.7/libstdc++-v3/src/.libs -L[...]/hurd/master.build/i686-unknown-gnu0.7/libstdc++-v3/libsupc++/.libs -B[...]/hurd/master.build/i686-unknown-gnu0.7/libstdc++-v3/src/.libs -B[...]/hurd/master.build/i686-unknown-gnu0.7/libstdc++-v3/libsupc++/.libs -B[...]/hurd/master.build.install/i686-unknown-gnu0.7/bin/ -B[...]/hurd/master.build.install/i686-unknown-gnu0.7/lib/ -isystem [...]/hurd/master.build.install/i686-unknown-gnu0.7/include -isystem [...]/hurd/master.build.install/i686-unknown-gnu0.7/sys-include " "LD=[...]/hurd/master.build/./gcc/collect-ld" "LIBCFLAGS=-g -O2" "NM=[...]/hurd/master.build/./gcc/nm" "PICFLAG=" "RANLIB=ranlib" "DESTDIR=" DO=all multi-do # make +make[3]: Entering directory '[...]/hurd/master.build/i686-unknown-gnu0.7/libssp' if [ -z "" ]; then \ true; \ else \ rootpre=`${PWDCMD-pwd}`/; export rootpre; \ srcrootpre=`cd ../../../master/libssp; ${PWDCMD-pwd}`/; export srcrootpre; \ lib=`echo "${rootpre}" | sed -e 's,^.*/\([^/][^/]*\)/$,\1,'`; \ - compiler="[...]/hurd/master.build/./gcc/xgcc -B[...]/hurd/master.build/./gcc/ -B[...]/hurd/master.build.install/i686-unknown-gnu0.6/bin/ -B[...]/hurd/master.build.install/i686-unknown-gnu0.6/lib/ -isystem [...]/hurd/master.build.install/i686-unknown-gnu0.6/include -isystem [...]/hurd/master.build.install/i686-unknown-gnu0.6/sys-include "; \ + compiler="[...]/hurd/master.build/./gcc/xgcc -B[...]/hurd/master.build/./gcc/ -B[...]/hurd/master.build.install/i686-unknown-gnu0.7/bin/ -B[...]/hurd/master.build.install/i686-unknown-gnu0.7/lib/ -isystem [...]/hurd/master.build.install/i686-unknown-gnu0.7/include -isystem [...]/hurd/master.build.install/i686-unknown-gnu0.7/sys-include "; \ for i in `${compiler} --print-multi-lib 2>/dev/null`; do \ dir=`echo $i | sed -e 's/;.*$//'`; \ if [ "${dir}" = "." ]; then \ @@ -1046,18 +1046,18 @@ else \ fi; \ done; \ fi -make[3]: Leaving directory '[...]/hurd/master.build/i686-unknown-gnu0.6/libssp' -make[2]: Leaving directory '[...]/hurd/master.build/i686-unknown-gnu0.6/libssp' -make[2]: Entering directory '[...]/hurd/master.build/i686-unknown-gnu0.6/libbacktrace' +make[3]: Leaving directory '[...]/hurd/master.build/i686-unknown-gnu0.7/libssp' +make[2]: Leaving directory '[...]/hurd/master.build/i686-unknown-gnu0.7/libssp' +make[2]: Entering directory '[...]/hurd/master.build/i686-unknown-gnu0.7/libbacktrace' make DO=all multi-do # make -make[3]: Entering directory '[...]/hurd/master.build/i686-unknown-gnu0.6/libbacktrace' +make[3]: Entering directory '[...]/hurd/master.build/i686-unknown-gnu0.7/libbacktrace' if [ -z "" ]; then \ true; \ else \ rootpre=`${PWDCMD-pwd}`/; export rootpre; \ srcrootpre=`cd ../../../master/libbacktrace; ${PWDCMD-pwd}`/; export srcrootpre; \ lib=`echo "${rootpre}" | sed -e 's,^.*/\([^/][^/]*\)/$,\1,'`; \ - compiler="[...]/hurd/master.build/./gcc/xgcc -B[...]/hurd/master.build/./gcc/ -B[...]/hurd/master.build.install/i686-unknown-gnu0.6/bin/ -B[...]/hurd/master.build.install/i686-unknown-gnu0.6/lib/ -isystem [...]/hurd/master.build.install/i686-unknown-gnu0.6/include -isystem [...]/hurd/master.build.install/i686-unknown-gnu0.6/sys-include "; \ + compiler="[...]/hurd/master.build/./gcc/xgcc -B[...]/hurd/master.build/./gcc/ -B[...]/hurd/master.build.install/i686-unknown-gnu0.7/bin/ -B[...]/hurd/master.build.install/i686-unknown-gnu0.7/lib/ -isystem [...]/hurd/master.build.install/i686-unknown-gnu0.7/include -isystem [...]/hurd/master.build.install/i686-unknown-gnu0.7/sys-include "; \ for i in `${compiler} --print-multi-lib 2>/dev/null`; do \ dir=`echo $i | sed -e 's/;.*$//'`; \ if [ "${dir}" = "." ]; then \ @@ -1095,18 +1095,18 @@ else \ fi; \ done; \ fi -make[3]: Leaving directory '[...]/hurd/master.build/i686-unknown-gnu0.6/libbacktrace' +make[3]: Leaving directory '[...]/hurd/master.build/i686-unknown-gnu0.7/libbacktrace' make btest stest -make[3]: Entering directory '[...]/hurd/master.build/i686-unknown-gnu0.6/libbacktrace' -[...]/hurd/master.build/./gcc/xgcc -B[...]/hurd/master.build/./gcc/ -B[...]/hurd/master.build.install/i686-unknown-gnu0.6/bin/ -B[...]/hurd/master.build.install/i686-unknown-gnu0.6/lib/ -isystem [...]/hurd/master.build.install/i686-unknown-gnu0.6/include -isystem [...]/hurd/master.build.install/i686-unknown-gnu0.6/sys-include -DHAVE_CONFIG_H -I. -I../../../master/libbacktrace -I ../../../master/libbacktrace/../include -I ../../../master/libbacktrace/../libgcc -I ../libgcc -funwind-tables -frandom-seed=btest-btest.o -W -Wall -Wwrite-strings -Wstrict-prototypes -Wmissing-prototypes -Wold-style-definition -Wmissing-format-attribute -Wcast-qual -Werror -g -O -g -O2 -c -o btest-btest.o `test -f 'btest.c' || echo '../../../master/libbacktrace/'`btest.c -/bin/dash ./libtool --tag=CC --mode=link [...]/hurd/master.build/./gcc/xgcc -B[...]/hurd/master.build/./gcc/ -B[...]/hurd/master.build.install/i686-unknown-gnu0.6/bin/ -B[...]/hurd/master.build.install/i686-unknown-gnu0.6/lib/ -isystem [...]/hurd/master.build.install/i686-unknown-gnu0.6/include -isystem [...]/hurd/master.build.install/i686-unknown-gnu0.6/sys-include -funwind-tables -frandom-seed=btest -W -Wall -Wwrite-strings -Wstrict-prototypes -Wmissing-prototypes -Wold-style-definition -Wmissing-format-attribute -Wcast-qual -Werror -g -O -g -O2 -o btest btest-btest.o libbacktrace.la -libtool: link: [...]/hurd/master.build/./gcc/xgcc -B[...]/hurd/master.build/./gcc/ -B[...]/hurd/master.build.install/i686-unknown-gnu0.6/bin/ -B[...]/hurd/master.build.install/i686-unknown-gnu0.6/lib/ -isystem [...]/hurd/master.build.install/i686-unknown-gnu0.6/include -isystem [...]/hurd/master.build.install/i686-unknown-gnu0.6/sys-include -funwind-tables -frandom-seed=btest -W -Wall -Wwrite-strings -Wstrict-prototypes -Wmissing-prototypes -Wold-style-definition -Wmissing-format-attribute -Wcast-qual -Werror -g -O -g -O2 -o btest btest-btest.o ./.libs/libbacktrace.a -[...]/hurd/master.build/./gcc/xgcc -B[...]/hurd/master.build/./gcc/ -B[...]/hurd/master.build.install/i686-unknown-gnu0.6/bin/ -B[...]/hurd/master.build.install/i686-unknown-gnu0.6/lib/ -isystem [...]/hurd/master.build.install/i686-unknown-gnu0.6/include -isystem [...]/hurd/master.build.install/i686-unknown-gnu0.6/sys-include -DHAVE_CONFIG_H -I. -I../../../master/libbacktrace -I ../../../master/libbacktrace/../include -I ../../../master/libbacktrace/../libgcc -I ../libgcc -funwind-tables -frandom-seed=stest.o -W -Wall -Wwrite-strings -Wstrict-prototypes -Wmissing-prototypes -Wold-style-definition -Wmissing-format-attribute -Wcast-qual -Werror -g -O2 -c ../../../master/libbacktrace/stest.c -/bin/dash ./libtool --tag=CC --mode=link [...]/hurd/master.build/./gcc/xgcc -B[...]/hurd/master.build/./gcc/ -B[...]/hurd/master.build.install/i686-unknown-gnu0.6/bin/ -B[...]/hurd/master.build.install/i686-unknown-gnu0.6/lib/ -isystem [...]/hurd/master.build.install/i686-unknown-gnu0.6/include -isystem [...]/hurd/master.build.install/i686-unknown-gnu0.6/sys-include -funwind-tables -frandom-seed=stest -W -Wall -Wwrite-strings -Wstrict-prototypes -Wmissing-prototypes -Wold-style-definition -Wmissing-format-attribute -Wcast-qual -Werror -g -O2 -o stest stest.o libbacktrace.la -libtool: link: [...]/hurd/master.build/./gcc/xgcc -B[...]/hurd/master.build/./gcc/ -B[...]/hurd/master.build.install/i686-unknown-gnu0.6/bin/ -B[...]/hurd/master.build.install/i686-unknown-gnu0.6/lib/ -isystem [...]/hurd/master.build.install/i686-unknown-gnu0.6/include -isystem [...]/hurd/master.build.install/i686-unknown-gnu0.6/sys-include -funwind-tables -frandom-seed=stest -W -Wall -Wwrite-strings -Wstrict-prototypes -Wmissing-prototypes -Wold-style-definition -Wmissing-format-attribute -Wcast-qual -Werror -g -O2 -o stest stest.o ./.libs/libbacktrace.a -make[3]: Leaving directory '[...]/hurd/master.build/i686-unknown-gnu0.6/libbacktrace' +make[3]: Entering directory '[...]/hurd/master.build/i686-unknown-gnu0.7/libbacktrace' +[...]/hurd/master.build/./gcc/xgcc -B[...]/hurd/master.build/./gcc/ -B[...]/hurd/master.build.install/i686-unknown-gnu0.7/bin/ -B[...]/hurd/master.build.install/i686-unknown-gnu0.7/lib/ -isystem [...]/hurd/master.build.install/i686-unknown-gnu0.7/include -isystem [...]/hurd/master.build.install/i686-unknown-gnu0.7/sys-include -DHAVE_CONFIG_H -I. -I../../../master/libbacktrace -I ../../../master/libbacktrace/../include -I ../../../master/libbacktrace/../libgcc -I ../libgcc -funwind-tables -frandom-seed=btest-btest.o -W -Wall -Wwrite-strings -Wstrict-prototypes -Wmissing-prototypes -Wold-style-definition -Wmissing-format-attribute -Wcast-qual -Werror -g -O -g -O2 -c -o btest-btest.o `test -f 'btest.c' || echo '../../../master/libbacktrace/'`btest.c +/bin/dash ./libtool --tag=CC --mode=link [...]/hurd/master.build/./gcc/xgcc -B[...]/hurd/master.build/./gcc/ -B[...]/hurd/master.build.install/i686-unknown-gnu0.7/bin/ -B[...]/hurd/master.build.install/i686-unknown-gnu0.7/lib/ -isystem [...]/hurd/master.build.install/i686-unknown-gnu0.7/include -isystem [...]/hurd/master.build.install/i686-unknown-gnu0.7/sys-include -funwind-tables -frandom-seed=btest -W -Wall -Wwrite-strings -Wstrict-prototypes -Wmissing-prototypes -Wold-style-definition -Wmissing-format-attribute -Wcast-qual -Werror -g -O -g -O2 -o btest btest-btest.o libbacktrace.la +libtool: link: [...]/hurd/master.build/./gcc/xgcc -B[...]/hurd/master.build/./gcc/ -B[...]/hurd/master.build.install/i686-unknown-gnu0.7/bin/ -B[...]/hurd/master.build.install/i686-unknown-gnu0.7/lib/ -isystem [...]/hurd/master.build.install/i686-unknown-gnu0.7/include -isystem [...]/hurd/master.build.install/i686-unknown-gnu0.7/sys-include -funwind-tables -frandom-seed=btest -W -Wall -Wwrite-strings -Wstrict-prototypes -Wmissing-prototypes -Wold-style-definition -Wmissing-format-attribute -Wcast-qual -Werror -g -O -g -O2 -o btest btest-btest.o ./.libs/libbacktrace.a +[...]/hurd/master.build/./gcc/xgcc -B[...]/hurd/master.build/./gcc/ -B[...]/hurd/master.build.install/i686-unknown-gnu0.7/bin/ -B[...]/hurd/master.build.install/i686-unknown-gnu0.7/lib/ -isystem [...]/hurd/master.build.install/i686-unknown-gnu0.7/include -isystem [...]/hurd/master.build.install/i686-unknown-gnu0.7/sys-include -DHAVE_CONFIG_H -I. -I../../../master/libbacktrace -I ../../../master/libbacktrace/../include -I ../../../master/libbacktrace/../libgcc -I ../libgcc -funwind-tables -frandom-seed=stest.o -W -Wall -Wwrite-strings -Wstrict-prototypes -Wmissing-prototypes -Wold-style-definition -Wmissing-format-attribute -Wcast-qual -Werror -g -O2 -c ../../../master/libbacktrace/stest.c +/bin/dash ./libtool --tag=CC --mode=link [...]/hurd/master.build/./gcc/xgcc -B[...]/hurd/master.build/./gcc/ -B[...]/hurd/master.build.install/i686-unknown-gnu0.7/bin/ -B[...]/hurd/master.build.install/i686-unknown-gnu0.7/lib/ -isystem [...]/hurd/master.build.install/i686-unknown-gnu0.7/include -isystem [...]/hurd/master.build.install/i686-unknown-gnu0.7/sys-include -funwind-tables -frandom-seed=stest -W -Wall -Wwrite-strings -Wstrict-prototypes -Wmissing-prototypes -Wold-style-definition -Wmissing-format-attribute -Wcast-qual -Werror -g -O2 -o stest stest.o libbacktrace.la +libtool: link: [...]/hurd/master.build/./gcc/xgcc -B[...]/hurd/master.build/./gcc/ -B[...]/hurd/master.build.install/i686-unknown-gnu0.7/bin/ -B[...]/hurd/master.build.install/i686-unknown-gnu0.7/lib/ -isystem [...]/hurd/master.build.install/i686-unknown-gnu0.7/include -isystem [...]/hurd/master.build.install/i686-unknown-gnu0.7/sys-include -funwind-tables -frandom-seed=stest -W -Wall -Wwrite-strings -Wstrict-prototypes -Wmissing-prototypes -Wold-style-definition -Wmissing-format-attribute -Wcast-qual -Werror -g -O2 -o stest stest.o ./.libs/libbacktrace.a +make[3]: Leaving directory '[...]/hurd/master.build/i686-unknown-gnu0.7/libbacktrace' make check-TESTS -make[3]: Entering directory '[...]/hurd/master.build/i686-unknown-gnu0.6/libbacktrace' +make[3]: Entering directory '[...]/hurd/master.build/i686-unknown-gnu0.7/libbacktrace' PASS: backtrace_full noinline PASS: backtrace_full inline PASS: backtrace_simple noinline @@ -1117,18 +1117,18 @@ PASS: stest ================== All 2 tests passed ================== -make[3]: Leaving directory '[...]/hurd/master.build/i686-unknown-gnu0.6/libbacktrace' -make[2]: Leaving directory '[...]/hurd/master.build/i686-unknown-gnu0.6/libbacktrace' -make[2]: Entering directory '[...]/hurd/master.build/i686-unknown-gnu0.6/libquadmath' -make "AR_FLAGS=rc" "CC_FOR_BUILD=gcc-4.9" "CFLAGS=-g -O2" "CXXFLAGS=-g -O2 -D_GNU_SOURCE" "CFLAGS_FOR_BUILD=-g -O2" "CFLAGS_FOR_TARGET=-g -O2" "INSTALL=/usr/bin/install -c" "INSTALL_DATA=/usr/bin/install -c -m 644" "INSTALL_PROGRAM=/usr/bin/install -c" "INSTALL_SCRIPT=/usr/bin/install -c" "JC1FLAGS=" "LDFLAGS=" "LIBCFLAGS=-g -O2" "LIBCFLAGS_FOR_TARGET=-g -O2" "MAKE=make" "MAKEINFO=makeinfo --split-size=5000000 --split-size=5000000 -I ../../../master/libquadmath/../gcc/doc/include" "PICFLAG=" "PICFLAG_FOR_TARGET=" "SHELL=/bin/dash" "RUNTESTFLAGS=" "exec_prefix=[...]/hurd/master.build.install" "infodir=[...]/hurd/master.build.install/share/info" "libdir=[...]/hurd/master.build.install/lib" "prefix=[...]/hurd/master.build.install" "includedir=[...]/hurd/master.build.install/include" "AR=ar" "AS=[...]/hurd/master.build/./gcc/as" "CC=[...]/hurd/master.build/./gcc/xgcc -B[...]/hurd/master.build/./gcc/ -B[...]/hurd/master.build.install/i686-unknown-gnu0.6/bin/ -B[...]/hurd/master.build.install/i686-unknown-gnu0.6/lib/ -isystem [...]/hurd/master.build.install/i686-unknown-gnu0.6/include -isystem [...]/hurd/master.build.install/i686-unknown-gnu0.6/sys-include " "CXX=[...]/hurd/master.build/./gcc/xg++ -B[...]/hurd/master.build/./gcc/ -nostdinc++ -nostdinc++ -I[...]/hurd/master.build/i686-unknown-gnu0.6/libstdc++-v3/include/i686-unknown-gnu0.6 -I[...]/hurd/master.build/i686-unknown-gnu0.6/libstdc++-v3/include -I[...]/hurd/master/libstdc++-v3/libsupc++ -I[...]/hurd/master/libstdc++-v3/include/backward -I[...]/hurd/master/libstdc++-v3/testsuite/util -L[...]/hurd/master.build/i686-unknown-gnu0.6/libstdc++-v3/src -L[...]/hurd/master.build/i686-unknown-gnu0.6/libstdc++-v3/src/.libs -L[...]/hurd/master.build/i686-unknown-gnu0.6/libstdc++-v3/libsupc++/.libs -B[...]/hurd/master.build/i686-unknown-gnu0.6/libstdc++-v3/src/.libs -B[...]/hurd/master.build/i686-unknown-gnu0.6/libstdc++-v3/libsupc++/.libs -B[...]/hurd/master.build.install/i686-unknown-gnu0.6/bin/ -B[...]/hurd/master.build.install/i686-unknown-gnu0.6/lib/ -isystem [...]/hurd/master.build.install/i686-unknown-gnu0.6/include -isystem [...]/hurd/master.build.install/i686-unknown-gnu0.6/sys-include " "LD=[...]/hurd/master.build/./gcc/collect-ld" "LIBCFLAGS=-g -O2" "NM=[...]/hurd/master.build/./gcc/nm" "PICFLAG=" "RANLIB=ranlib" "DESTDIR=" DO=all multi-do # make -make[3]: Entering directory '[...]/hurd/master.build/i686-unknown-gnu0.6/libquadmath' +make[3]: Leaving directory '[...]/hurd/master.build/i686-unknown-gnu0.7/libbacktrace' +make[2]: Leaving directory '[...]/hurd/master.build/i686-unknown-gnu0.7/libbacktrace' +make[2]: Entering directory '[...]/hurd/master.build/i686-unknown-gnu0.7/libquadmath' +make "AR_FLAGS=rc" "CC_FOR_BUILD=gcc-4.9" "CFLAGS=-g -O2" "CXXFLAGS=-g -O2 -D_GNU_SOURCE" "CFLAGS_FOR_BUILD=-g -O2" "CFLAGS_FOR_TARGET=-g -O2" "INSTALL=/usr/bin/install -c" "INSTALL_DATA=/usr/bin/install -c -m 644" "INSTALL_PROGRAM=/usr/bin/install -c" "INSTALL_SCRIPT=/usr/bin/install -c" "JC1FLAGS=" "LDFLAGS=" "LIBCFLAGS=-g -O2" "LIBCFLAGS_FOR_TARGET=-g -O2" "MAKE=make" "MAKEINFO=makeinfo --split-size=5000000 --split-size=5000000 -I ../../../master/libquadmath/../gcc/doc/include" "PICFLAG=" "PICFLAG_FOR_TARGET=" "SHELL=/bin/dash" "RUNTESTFLAGS=" "exec_prefix=[...]/hurd/master.build.install" "infodir=[...]/hurd/master.build.install/share/info" "libdir=[...]/hurd/master.build.install/lib" "prefix=[...]/hurd/master.build.install" "includedir=[...]/hurd/master.build.install/include" "AR=ar" "AS=[...]/hurd/master.build/./gcc/as" "CC=[...]/hurd/master.build/./gcc/xgcc -B[...]/hurd/master.build/./gcc/ -B[...]/hurd/master.build.install/i686-unknown-gnu0.7/bin/ -B[...]/hurd/master.build.install/i686-unknown-gnu0.7/lib/ -isystem [...]/hurd/master.build.install/i686-unknown-gnu0.7/include -isystem [...]/hurd/master.build.install/i686-unknown-gnu0.7/sys-include " "CXX=[...]/hurd/master.build/./gcc/xg++ -B[...]/hurd/master.build/./gcc/ -nostdinc++ -nostdinc++ -I[...]/hurd/master.build/i686-unknown-gnu0.7/libstdc++-v3/include/i686-unknown-gnu0.7 -I[...]/hurd/master.build/i686-unknown-gnu0.7/libstdc++-v3/include -I[...]/hurd/master/libstdc++-v3/libsupc++ -I[...]/hurd/master/libstdc++-v3/include/backward -I[...]/hurd/master/libstdc++-v3/testsuite/util -L[...]/hurd/master.build/i686-unknown-gnu0.7/libstdc++-v3/src -L[...]/hurd/master.build/i686-unknown-gnu0.7/libstdc++-v3/src/.libs -L[...]/hurd/master.build/i686-unknown-gnu0.7/libstdc++-v3/libsupc++/.libs -B[...]/hurd/master.build/i686-unknown-gnu0.7/libstdc++-v3/src/.libs -B[...]/hurd/master.build/i686-unknown-gnu0.7/libstdc++-v3/libsupc++/.libs -B[...]/hurd/master.build.install/i686-unknown-gnu0.7/bin/ -B[...]/hurd/master.build.install/i686-unknown-gnu0.7/lib/ -isystem [...]/hurd/master.build.install/i686-unknown-gnu0.7/include -isystem [...]/hurd/master.build.install/i686-unknown-gnu0.7/sys-include " "LD=[...]/hurd/master.build/./gcc/collect-ld" "LIBCFLAGS=-g -O2" "NM=[...]/hurd/master.build/./gcc/nm" "PICFLAG=" "RANLIB=ranlib" "DESTDIR=" DO=all multi-do # make +make[3]: Entering directory '[...]/hurd/master.build/i686-unknown-gnu0.7/libquadmath' if [ -z "" ]; then \ true; \ else \ rootpre=`${PWDCMD-pwd}`/; export rootpre; \ srcrootpre=`cd ../../../master/libquadmath; ${PWDCMD-pwd}`/; export srcrootpre; \ lib=`echo "${rootpre}" | sed -e 's,^.*/\([^/][^/]*\)/$,\1,'`; \ - compiler="[...]/hurd/master.build/./gcc/xgcc -B[...]/hurd/master.build/./gcc/ -B[...]/hurd/master.build.install/i686-unknown-gnu0.6/bin/ -B[...]/hurd/master.build.install/i686-unknown-gnu0.6/lib/ -isystem [...]/hurd/master.build.install/i686-unknown-gnu0.6/include -isystem [...]/hurd/master.build.install/i686-unknown-gnu0.6/sys-include "; \ + compiler="[...]/hurd/master.build/./gcc/xgcc -B[...]/hurd/master.build/./gcc/ -B[...]/hurd/master.build.install/i686-unknown-gnu0.7/bin/ -B[...]/hurd/master.build.install/i686-unknown-gnu0.7/lib/ -isystem [...]/hurd/master.build.install/i686-unknown-gnu0.7/include -isystem [...]/hurd/master.build.install/i686-unknown-gnu0.7/sys-include "; \ for i in `${compiler} --print-multi-lib 2>/dev/null`; do \ dir=`echo $i | sed -e 's/;.*$//'`; \ if [ "${dir}" = "." ]; then \ @@ -1136,7 +1136,7 @@ else \ else \ if [ -d ../${dir}/${lib} ]; then \ flags=`echo $i | sed -e 's/^[^;]*;//' -e 's/@/ -/g'`; \ - if (cd ../${dir}/${lib}; make "AR_FLAGS=rc" "CC_FOR_BUILD=gcc-4.9" "CFLAGS=-g -O2" "CXXFLAGS=-g -O2 -D_GNU_SOURCE" "CFLAGS_FOR_BUILD=-g -O2" "CFLAGS_FOR_TARGET=-g -O2" "INSTALL=/usr/bin/install -c" "INSTALL_DATA=/usr/bin/install -c -m 644" "INSTALL_PROGRAM=/usr/bin/install -c" "INSTALL_SCRIPT=/usr/bin/install -c" "JC1FLAGS=" "LDFLAGS=" "LIBCFLAGS=-g -O2" "LIBCFLAGS_FOR_TARGET=-g -O2" "MAKE=make" "MAKEINFO=makeinfo --split-size=5000000 --split-size=5000000 -I ../../../master/libquadmath/../gcc/doc/include -I ../../../master/libquadmath/../gcc/doc/include" "PICFLAG=" "PICFLAG_FOR_TARGET=" "SHELL=/bin/dash" "RUNTESTFLAGS=" "exec_prefix=[...]/hurd/master.build.install" "infodir=[...]/hurd/master.build.install/share/info" "libdir=[...]/hurd/master.build.install/lib" "prefix=[...]/hurd/master.build.install" "includedir=[...]/hurd/master.build.install/include" "AR=ar" "AS=[...]/hurd/master.build/./gcc/as" "CC=[...]/hurd/master.build/./gcc/xgcc -B[...]/hurd/master.build/./gcc/ -B[...]/hurd/master.build.install/i686-unknown-gnu0.6/bin/ -B[...]/hurd/master.build.install/i686-unknown-gnu0.6/lib/ -isystem [...]/hurd/master.build.install/i686-unknown-gnu0.6/include -isystem [...]/hurd/master.build.install/i686-unknown-gnu0.6/sys-include " "CXX=[...]/hurd/master.build/./gcc/xg++ -B[...]/hurd/master.build/./gcc/ -nostdinc++ -nostdinc++ -I[...]/hurd/master.build/i686-unknown-gnu0.6/libstdc++-v3/include/i686-unknown-gnu0.6 -I[...]/hurd/master.build/i686-unknown-gnu0.6/libstdc++-v3/include -I[...]/hurd/master/libstdc++-v3/libsupc++ -I[...]/hurd/master/libstdc++-v3/include/backward -I[...]/hurd/master/libstdc++-v3/testsuite/util -L[...]/hurd/master.build/i686-unknown-gnu0.6/libstdc++-v3/src -L[...]/hurd/master.build/i686-unknown-gnu0.6/libstdc++-v3/src/.libs -L[...]/hurd/master.build/i686-unknown-gnu0.6/libstdc++-v3/libsupc++/.libs -B[...]/hurd/master.build/i686-unknown-gnu0.6/libstdc++-v3/src/.libs -B[...]/hurd/master.build/i686-unknown-gnu0.6/libstdc++-v3/libsupc++/.libs -B[...]/hurd/master.build.install/i686-unknown-gnu0.6/bin/ -B[...]/hurd/master.build.install/i686-unknown-gnu0.6/lib/ -isystem [...]/hurd/master.build.install/i686-unknown-gnu0.6/include -isystem [...]/hurd/master.build.install/i686-unknown-gnu0.6/sys-include " "LD=[...]/hurd/master.build/./gcc/collect-ld" "LIBCFLAGS=-g -O2" "NM=[...]/hurd/master.build/./gcc/nm" "PICFLAG=" "RANLIB=ranlib" "DESTDIR=" \ + if (cd ../${dir}/${lib}; make "AR_FLAGS=rc" "CC_FOR_BUILD=gcc-4.9" "CFLAGS=-g -O2" "CXXFLAGS=-g -O2 -D_GNU_SOURCE" "CFLAGS_FOR_BUILD=-g -O2" "CFLAGS_FOR_TARGET=-g -O2" "INSTALL=/usr/bin/install -c" "INSTALL_DATA=/usr/bin/install -c -m 644" "INSTALL_PROGRAM=/usr/bin/install -c" "INSTALL_SCRIPT=/usr/bin/install -c" "JC1FLAGS=" "LDFLAGS=" "LIBCFLAGS=-g -O2" "LIBCFLAGS_FOR_TARGET=-g -O2" "MAKE=make" "MAKEINFO=makeinfo --split-size=5000000 --split-size=5000000 -I ../../../master/libquadmath/../gcc/doc/include -I ../../../master/libquadmath/../gcc/doc/include" "PICFLAG=" "PICFLAG_FOR_TARGET=" "SHELL=/bin/dash" "RUNTESTFLAGS=" "exec_prefix=[...]/hurd/master.build.install" "infodir=[...]/hurd/master.build.install/share/info" "libdir=[...]/hurd/master.build.install/lib" "prefix=[...]/hurd/master.build.install" "includedir=[...]/hurd/master.build.install/include" "AR=ar" "AS=[...]/hurd/master.build/./gcc/as" "CC=[...]/hurd/master.build/./gcc/xgcc -B[...]/hurd/master.build/./gcc/ -B[...]/hurd/master.build.install/i686-unknown-gnu0.7/bin/ -B[...]/hurd/master.build.install/i686-unknown-gnu0.7/lib/ -isystem [...]/hurd/master.build.install/i686-unknown-gnu0.7/include -isystem [...]/hurd/master.build.install/i686-unknown-gnu0.7/sys-include " "CXX=[...]/hurd/master.build/./gcc/xg++ -B[...]/hurd/master.build/./gcc/ -nostdinc++ -nostdinc++ -I[...]/hurd/master.build/i686-unknown-gnu0.7/libstdc++-v3/include/i686-unknown-gnu0.7 -I[...]/hurd/master.build/i686-unknown-gnu0.7/libstdc++-v3/include -I[...]/hurd/master/libstdc++-v3/libsupc++ -I[...]/hurd/master/libstdc++-v3/include/backward -I[...]/hurd/master/libstdc++-v3/testsuite/util -L[...]/hurd/master.build/i686-unknown-gnu0.7/libstdc++-v3/src -L[...]/hurd/master.build/i686-unknown-gnu0.7/libstdc++-v3/src/.libs -L[...]/hurd/master.build/i686-unknown-gnu0.7/libstdc++-v3/libsupc++/.libs -B[...]/hurd/master.build/i686-unknown-gnu0.7/libstdc++-v3/src/.libs -B[...]/hurd/master.build/i686-unknown-gnu0.7/libstdc++-v3/libsupc++/.libs -B[...]/hurd/master.build.install/i686-unknown-gnu0.7/bin/ -B[...]/hurd/master.build.install/i686-unknown-gnu0.7/lib/ -isystem [...]/hurd/master.build.install/i686-unknown-gnu0.7/include -isystem [...]/hurd/master.build.install/i686-unknown-gnu0.7/sys-include " "LD=[...]/hurd/master.build/./gcc/collect-ld" "LIBCFLAGS=-g -O2" "NM=[...]/hurd/master.build/./gcc/nm" "PICFLAG=" "RANLIB=ranlib" "DESTDIR=" \ CFLAGS="-g -O2 ${flags}" \ CCASFLAGS=" ${flags}" \ FCFLAGS=" ${flags}" \ @@ -1166,20 +1166,20 @@ else \ fi; \ done; \ fi -make[3]: Leaving directory '[...]/hurd/master.build/i686-unknown-gnu0.6/libquadmath' -make[2]: Leaving directory '[...]/hurd/master.build/i686-unknown-gnu0.6/libquadmath' -make[2]: Entering directory '[...]/hurd/master.build/i686-unknown-gnu0.6/libgfortran' +make[3]: Leaving directory '[...]/hurd/master.build/i686-unknown-gnu0.7/libquadmath' +make[2]: Leaving directory '[...]/hurd/master.build/i686-unknown-gnu0.7/libquadmath' +make[2]: Entering directory '[...]/hurd/master.build/i686-unknown-gnu0.7/libgfortran' make check-am -make[3]: Entering directory '[...]/hurd/master.build/i686-unknown-gnu0.6/libgfortran' +make[3]: Entering directory '[...]/hurd/master.build/i686-unknown-gnu0.7/libgfortran' make DO=all multi-do # make -make[4]: Entering directory '[...]/hurd/master.build/i686-unknown-gnu0.6/libgfortran' +make[4]: Entering directory '[...]/hurd/master.build/i686-unknown-gnu0.7/libgfortran' if [ -z "" ]; then \ true; \ else \ rootpre=`${PWDCMD-pwd}`/; export rootpre; \ srcrootpre=`cd ../../../master/libgfortran; ${PWDCMD-pwd}`/; export srcrootpre; \ lib=`echo "${rootpre}" | sed -e 's,^.*/\([^/][^/]*\)/$,\1,'`; \ - compiler="[...]/hurd/master.build/./gcc/xgcc -B[...]/hurd/master.build/./gcc/ -B[...]/hurd/master.build.install/i686-unknown-gnu0.6/bin/ -B[...]/hurd/master.build.install/i686-unknown-gnu0.6/lib/ -isystem [...]/hurd/master.build.install/i686-unknown-gnu0.6/include -isystem [...]/hurd/master.build.install/i686-unknown-gnu0.6/sys-include "; \ + compiler="[...]/hurd/master.build/./gcc/xgcc -B[...]/hurd/master.build/./gcc/ -B[...]/hurd/master.build.install/i686-unknown-gnu0.7/bin/ -B[...]/hurd/master.build.install/i686-unknown-gnu0.7/lib/ -isystem [...]/hurd/master.build.install/i686-unknown-gnu0.7/include -isystem [...]/hurd/master.build.install/i686-unknown-gnu0.7/sys-include "; \ for i in `${compiler} --print-multi-lib 2>/dev/null`; do \ dir=`echo $i | sed -e 's/;.*$//'`; \ if [ "${dir}" = "." ]; then \ @@ -1217,23 +1217,21 @@ else \ fi; \ done; \ fi -make[4]: Leaving directory '[...]/hurd/master.build/i686-unknown-gnu0.6/libgfortran' -: -: -make[3]: Leaving directory '[...]/hurd/master.build/i686-unknown-gnu0.6/libgfortran' -make[2]: Leaving directory '[...]/hurd/master.build/i686-unknown-gnu0.6/libgfortran' -make[2]: Entering directory '[...]/hurd/master.build/i686-unknown-gnu0.6/libobjc' +make[4]: Leaving directory '[...]/hurd/master.build/i686-unknown-gnu0.7/libgfortran' +make[3]: Leaving directory '[...]/hurd/master.build/i686-unknown-gnu0.7/libgfortran' +make[2]: Leaving directory '[...]/hurd/master.build/i686-unknown-gnu0.7/libgfortran' +make[2]: Entering directory '[...]/hurd/master.build/i686-unknown-gnu0.7/libobjc' make[2]: Nothing to be done for 'check'. -make[2]: Leaving directory '[...]/hurd/master.build/i686-unknown-gnu0.6/libobjc' -make[2]: Entering directory '[...]/hurd/master.build/i686-unknown-gnu0.6/libffi' +make[2]: Leaving directory '[...]/hurd/master.build/i686-unknown-gnu0.7/libobjc' +make[2]: Entering directory '[...]/hurd/master.build/i686-unknown-gnu0.7/libffi' Making check in include -make[3]: Entering directory '[...]/hurd/master.build/i686-unknown-gnu0.6/libffi/include' +make[3]: Entering directory '[...]/hurd/master.build/i686-unknown-gnu0.7/libffi/include' make[3]: Nothing to be done for 'check'. -make[3]: Leaving directory '[...]/hurd/master.build/i686-unknown-gnu0.6/libffi/include' +make[3]: Leaving directory '[...]/hurd/master.build/i686-unknown-gnu0.7/libffi/include' Making check in testsuite -make[3]: Entering directory '[...]/hurd/master.build/i686-unknown-gnu0.6/libffi/testsuite' +make[3]: Entering directory '[...]/hurd/master.build/i686-unknown-gnu0.7/libffi/testsuite' make check-DEJAGNU -make[4]: Entering directory '[...]/hurd/master.build/i686-unknown-gnu0.6/libffi/testsuite' +make[4]: Entering directory '[...]/hurd/master.build/i686-unknown-gnu0.7/libffi/testsuite' Making a new site.exp file... srcdir='../../../../master/libffi/testsuite'; export srcdir; \ EXPECT=`if [ -f ../../expect/expect ] ; then echo ../../expect/expect ; else echo expect ; fi`; export EXPECT; \ @@ -1246,8 +1244,8 @@ if /bin/dash -c "$runtest --version" > /dev/null 2>&1; then \ else echo "WARNING: could not find \`runtest'" 1>&2; :;\ fi; \ exit $exit_status -Test Run By thomas on Wed Apr 20 09:31:57 2016 -Native configuration is i686-unknown-gnu0.6 +Test Run By thomas on Fri May 20 02:05:05 2016 +Native configuration is i686-unknown-gnu0.7 === libffi tests === @@ -1267,22 +1265,22 @@ Running ../../../../master/libffi/testsuite/libffi.special/special.exp ... # of expected passes 2439 # of unsupported tests 30 -make[4]: Leaving directory '[...]/hurd/master.build/i686-unknown-gnu0.6/libffi/testsuite' -make[3]: Leaving directory '[...]/hurd/master.build/i686-unknown-gnu0.6/libffi/testsuite' +make[4]: Leaving directory '[...]/hurd/master.build/i686-unknown-gnu0.7/libffi/testsuite' +make[3]: Leaving directory '[...]/hurd/master.build/i686-unknown-gnu0.7/libffi/testsuite' Making check in man -make[3]: Entering directory '[...]/hurd/master.build/i686-unknown-gnu0.6/libffi/man' +make[3]: Entering directory '[...]/hurd/master.build/i686-unknown-gnu0.7/libffi/man' make[3]: Nothing to be done for 'check'. -make[3]: Leaving directory '[...]/hurd/master.build/i686-unknown-gnu0.6/libffi/man' -make[3]: Entering directory '[...]/hurd/master.build/i686-unknown-gnu0.6/libffi' -make "AR_FLAGS=rc" "CC_FOR_BUILD=gcc-4.9" "CFLAGS=-g -O2" "CXXFLAGS=-g -O2 -D_GNU_SOURCE" "CFLAGS_FOR_BUILD=-g -O2" "CFLAGS_FOR_TARGET=-g -O2" "INSTALL=/usr/bin/install -c" "INSTALL_DATA=/usr/bin/install -c -m 644" "INSTALL_PROGRAM=/usr/bin/install -c" "INSTALL_SCRIPT=/usr/bin/install -c" "JC1FLAGS=" "LDFLAGS=" "LIBCFLAGS=-g -O2" "LIBCFLAGS_FOR_TARGET=-g -O2" "MAKE=make" "MAKEINFO=makeinfo --split-size=5000000 --split-size=5000000 -I ../../../master/libffi/../gcc/doc/include -I ../../../master/libffi/../gcc/doc/include" "PICFLAG=" "PICFLAG_FOR_TARGET=" "RUNTESTFLAGS=" "SHELL=/bin/dash" "exec_prefix=[...]/hurd/master.build.install" "infodir=[...]/hurd/master.build.install/share/info" "libdir=[...]/hurd/master.build.install/lib" "mandir=[...]/hurd/master.build.install/share/man" "prefix=[...]/hurd/master.build.install" "AR=ar" "AS=[...]/hurd/master.build/./gcc/as" "CC=[...]/hurd/master.build/./gcc/xgcc -B[...]/hurd/master.build/./gcc/ -B[...]/hurd/master.build.install/i686-unknown-gnu0.6/bin/ -B[...]/hurd/master.build.install/i686-unknown-gnu0.6/lib/ -isystem [...]/hurd/master.build.install/i686-unknown-gnu0.6/include -isystem [...]/hurd/master.build.install/i686-unknown-gnu0.6/sys-include " "CXX=[...]/hurd/master.build/./gcc/xg++ -B[...]/hurd/master.build/./gcc/ -nostdinc++ -nostdinc++ -I[...]/hurd/master.build/i686-unknown-gnu0.6/libstdc++-v3/include/i686-unknown-gnu0.6 -I[...]/hurd/master.build/i686-unknown-gnu0.6/libstdc++-v3/include -I[...]/hurd/master/libstdc++-v3/libsupc++ -I[...]/hurd/master/libstdc++-v3/include/backward -I[...]/hurd/master/libstdc++-v3/testsuite/util -L[...]/hurd/master.build/i686-unknown-gnu0.6/libstdc++-v3/src -L[...]/hurd/master.build/i686-unknown-gnu0.6/libstdc++-v3/src/.libs -L[...]/hurd/master.build/i686-unknown-gnu0.6/libstdc++-v3/libsupc++/.libs -B[...]/hurd/master.build/i686-unknown-gnu0.6/libstdc++-v3/src/.libs -B[...]/hurd/master.build/i686-unknown-gnu0.6/libstdc++-v3/libsupc++/.libs -B[...]/hurd/master.build.install/i686-unknown-gnu0.6/bin/ -B[...]/hurd/master.build.install/i686-unknown-gnu0.6/lib/ -isystem [...]/hurd/master.build.install/i686-unknown-gnu0.6/include -isystem [...]/hurd/master.build.install/i686-unknown-gnu0.6/sys-include " "LD=[...]/hurd/master.build/./gcc/collect-ld" "NM=[...]/hurd/master.build/./gcc/nm" "RANLIB=ranlib" "DESTDIR=" DO=all multi-do # make -make[4]: Entering directory '[...]/hurd/master.build/i686-unknown-gnu0.6/libffi' +make[3]: Leaving directory '[...]/hurd/master.build/i686-unknown-gnu0.7/libffi/man' +make[3]: Entering directory '[...]/hurd/master.build/i686-unknown-gnu0.7/libffi' +make "AR_FLAGS=rc" "CC_FOR_BUILD=gcc-4.9" "CFLAGS=-g -O2" "CXXFLAGS=-g -O2 -D_GNU_SOURCE" "CFLAGS_FOR_BUILD=-g -O2" "CFLAGS_FOR_TARGET=-g -O2" "INSTALL=/usr/bin/install -c" "INSTALL_DATA=/usr/bin/install -c -m 644" "INSTALL_PROGRAM=/usr/bin/install -c" "INSTALL_SCRIPT=/usr/bin/install -c" "JC1FLAGS=" "LDFLAGS=" "LIBCFLAGS=-g -O2" "LIBCFLAGS_FOR_TARGET=-g -O2" "MAKE=make" "MAKEINFO=makeinfo --split-size=5000000 --split-size=5000000 -I ../../../master/libffi/../gcc/doc/include -I ../../../master/libffi/../gcc/doc/include" "PICFLAG=" "PICFLAG_FOR_TARGET=" "RUNTESTFLAGS=" "SHELL=/bin/dash" "exec_prefix=[...]/hurd/master.build.install" "infodir=[...]/hurd/master.build.install/share/info" "libdir=[...]/hurd/master.build.install/lib" "mandir=[...]/hurd/master.build.install/share/man" "prefix=[...]/hurd/master.build.install" "AR=ar" "AS=[...]/hurd/master.build/./gcc/as" "CC=[...]/hurd/master.build/./gcc/xgcc -B[...]/hurd/master.build/./gcc/ -B[...]/hurd/master.build.install/i686-unknown-gnu0.7/bin/ -B[...]/hurd/master.build.install/i686-unknown-gnu0.7/lib/ -isystem [...]/hurd/master.build.install/i686-unknown-gnu0.7/include -isystem [...]/hurd/master.build.install/i686-unknown-gnu0.7/sys-include " "CXX=[...]/hurd/master.build/./gcc/xg++ -B[...]/hurd/master.build/./gcc/ -nostdinc++ -nostdinc++ -I[...]/hurd/master.build/i686-unknown-gnu0.7/libstdc++-v3/include/i686-unknown-gnu0.7 -I[...]/hurd/master.build/i686-unknown-gnu0.7/libstdc++-v3/include -I[...]/hurd/master/libstdc++-v3/libsupc++ -I[...]/hurd/master/libstdc++-v3/include/backward -I[...]/hurd/master/libstdc++-v3/testsuite/util -L[...]/hurd/master.build/i686-unknown-gnu0.7/libstdc++-v3/src -L[...]/hurd/master.build/i686-unknown-gnu0.7/libstdc++-v3/src/.libs -L[...]/hurd/master.build/i686-unknown-gnu0.7/libstdc++-v3/libsupc++/.libs -B[...]/hurd/master.build/i686-unknown-gnu0.7/libstdc++-v3/src/.libs -B[...]/hurd/master.build/i686-unknown-gnu0.7/libstdc++-v3/libsupc++/.libs -B[...]/hurd/master.build.install/i686-unknown-gnu0.7/bin/ -B[...]/hurd/master.build.install/i686-unknown-gnu0.7/lib/ -isystem [...]/hurd/master.build.install/i686-unknown-gnu0.7/include -isystem [...]/hurd/master.build.install/i686-unknown-gnu0.7/sys-include " "LD=[...]/hurd/master.build/./gcc/collect-ld" "NM=[...]/hurd/master.build/./gcc/nm" "RANLIB=ranlib" "DESTDIR=" DO=all multi-do # make +make[4]: Entering directory '[...]/hurd/master.build/i686-unknown-gnu0.7/libffi' if [ -z "" ]; then \ true; \ else \ rootpre=`${PWDCMD-pwd}`/; export rootpre; \ srcrootpre=`cd ../../../master/libffi; ${PWDCMD-pwd}`/; export srcrootpre; \ lib=`echo "${rootpre}" | sed -e 's,^.*/\([^/][^/]*\)/$,\1,'`; \ - compiler="[...]/hurd/master.build/./gcc/xgcc -B[...]/hurd/master.build/./gcc/ -B[...]/hurd/master.build.install/i686-unknown-gnu0.6/bin/ -B[...]/hurd/master.build.install/i686-unknown-gnu0.6/lib/ -isystem [...]/hurd/master.build.install/i686-unknown-gnu0.6/include -isystem [...]/hurd/master.build.install/i686-unknown-gnu0.6/sys-include "; \ + compiler="[...]/hurd/master.build/./gcc/xgcc -B[...]/hurd/master.build/./gcc/ -B[...]/hurd/master.build.install/i686-unknown-gnu0.7/bin/ -B[...]/hurd/master.build.install/i686-unknown-gnu0.7/lib/ -isystem [...]/hurd/master.build.install/i686-unknown-gnu0.7/include -isystem [...]/hurd/master.build.install/i686-unknown-gnu0.7/sys-include "; \ for i in `${compiler} --print-multi-lib 2>/dev/null`; do \ dir=`echo $i | sed -e 's/;.*$//'`; \ if [ "${dir}" = "." ]; then \ @@ -1290,7 +1288,7 @@ else \ else \ if [ -d ../${dir}/${lib} ]; then \ flags=`echo $i | sed -e 's/^[^;]*;//' -e 's/@/ -/g'`; \ - if (cd ../${dir}/${lib}; make "AR_FLAGS=rc" "CC_FOR_BUILD=gcc-4.9" "CFLAGS=-g -O2" "CXXFLAGS=-g -O2 -D_GNU_SOURCE" "CFLAGS_FOR_BUILD=-g -O2" "CFLAGS_FOR_TARGET=-g -O2" "INSTALL=/usr/bin/install -c" "INSTALL_DATA=/usr/bin/install -c -m 644" "INSTALL_PROGRAM=/usr/bin/install -c" "INSTALL_SCRIPT=/usr/bin/install -c" "JC1FLAGS=" "LDFLAGS=" "LIBCFLAGS=-g -O2" "LIBCFLAGS_FOR_TARGET=-g -O2" "MAKE=make" "MAKEINFO=makeinfo --split-size=5000000 --split-size=5000000 -I ../../../master/libffi/../gcc/doc/include -I ../../../master/libffi/../gcc/doc/include -I ../../../master/libffi/../gcc/doc/include" "PICFLAG=" "PICFLAG_FOR_TARGET=" "RUNTESTFLAGS=" "SHELL=/bin/dash" "exec_prefix=[...]/hurd/master.build.install" "infodir=[...]/hurd/master.build.install/share/info" "libdir=[...]/hurd/master.build.install/lib" "mandir=[...]/hurd/master.build.install/share/man" "prefix=[...]/hurd/master.build.install" "AR=ar" "AS=[...]/hurd/master.build/./gcc/as" "CC=[...]/hurd/master.build/./gcc/xgcc -B[...]/hurd/master.build/./gcc/ -B[...]/hurd/master.build.install/i686-unknown-gnu0.6/bin/ -B[...]/hurd/master.build.install/i686-unknown-gnu0.6/lib/ -isystem [...]/hurd/master.build.install/i686-unknown-gnu0.6/include -isystem [...]/hurd/master.build.install/i686-unknown-gnu0.6/sys-include " "CXX=[...]/hurd/master.build/./gcc/xg++ -B[...]/hurd/master.build/./gcc/ -nostdinc++ -nostdinc++ -I[...]/hurd/master.build/i686-unknown-gnu0.6/libstdc++-v3/include/i686-unknown-gnu0.6 -I[...]/hurd/master.build/i686-unknown-gnu0.6/libstdc++-v3/include -I[...]/hurd/master/libstdc++-v3/libsupc++ -I[...]/hurd/master/libstdc++-v3/include/backward -I[...]/hurd/master/libstdc++-v3/testsuite/util -L[...]/hurd/master.build/i686-unknown-gnu0.6/libstdc++-v3/src -L[...]/hurd/master.build/i686-unknown-gnu0.6/libstdc++-v3/src/.libs -L[...]/hurd/master.build/i686-unknown-gnu0.6/libstdc++-v3/libsupc++/.libs -B[...]/hurd/master.build/i686-unknown-gnu0.6/libstdc++-v3/src/.libs -B[...]/hurd/master.build/i686-unknown-gnu0.6/libstdc++-v3/libsupc++/.libs -B[...]/hurd/master.build.install/i686-unknown-gnu0.6/bin/ -B[...]/hurd/master.build.install/i686-unknown-gnu0.6/lib/ -isystem [...]/hurd/master.build.install/i686-unknown-gnu0.6/include -isystem [...]/hurd/master.build.install/i686-unknown-gnu0.6/sys-include " "LD=[...]/hurd/master.build/./gcc/collect-ld" "NM=[...]/hurd/master.build/./gcc/nm" "RANLIB=ranlib" "DESTDIR=" \ + if (cd ../${dir}/${lib}; make "AR_FLAGS=rc" "CC_FOR_BUILD=gcc-4.9" "CFLAGS=-g -O2" "CXXFLAGS=-g -O2 -D_GNU_SOURCE" "CFLAGS_FOR_BUILD=-g -O2" "CFLAGS_FOR_TARGET=-g -O2" "INSTALL=/usr/bin/install -c" "INSTALL_DATA=/usr/bin/install -c -m 644" "INSTALL_PROGRAM=/usr/bin/install -c" "INSTALL_SCRIPT=/usr/bin/install -c" "JC1FLAGS=" "LDFLAGS=" "LIBCFLAGS=-g -O2" "LIBCFLAGS_FOR_TARGET=-g -O2" "MAKE=make" "MAKEINFO=makeinfo --split-size=5000000 --split-size=5000000 -I ../../../master/libffi/../gcc/doc/include -I ../../../master/libffi/../gcc/doc/include -I ../../../master/libffi/../gcc/doc/include" "PICFLAG=" "PICFLAG_FOR_TARGET=" "RUNTESTFLAGS=" "SHELL=/bin/dash" "exec_prefix=[...]/hurd/master.build.install" "infodir=[...]/hurd/master.build.install/share/info" "libdir=[...]/hurd/master.build.install/lib" "mandir=[...]/hurd/master.build.install/share/man" "prefix=[...]/hurd/master.build.install" "AR=ar" "AS=[...]/hurd/master.build/./gcc/as" "CC=[...]/hurd/master.build/./gcc/xgcc -B[...]/hurd/master.build/./gcc/ -B[...]/hurd/master.build.install/i686-unknown-gnu0.7/bin/ -B[...]/hurd/master.build.install/i686-unknown-gnu0.7/lib/ -isystem [...]/hurd/master.build.install/i686-unknown-gnu0.7/include -isystem [...]/hurd/master.build.install/i686-unknown-gnu0.7/sys-include " "CXX=[...]/hurd/master.build/./gcc/xg++ -B[...]/hurd/master.build/./gcc/ -nostdinc++ -nostdinc++ -I[...]/hurd/master.build/i686-unknown-gnu0.7/libstdc++-v3/include/i686-unknown-gnu0.7 -I[...]/hurd/master.build/i686-unknown-gnu0.7/libstdc++-v3/include -I[...]/hurd/master/libstdc++-v3/libsupc++ -I[...]/hurd/master/libstdc++-v3/include/backward -I[...]/hurd/master/libstdc++-v3/testsuite/util -L[...]/hurd/master.build/i686-unknown-gnu0.7/libstdc++-v3/src -L[...]/hurd/master.build/i686-unknown-gnu0.7/libstdc++-v3/src/.libs -L[...]/hurd/master.build/i686-unknown-gnu0.7/libstdc++-v3/libsupc++/.libs -B[...]/hurd/master.build/i686-unknown-gnu0.7/libstdc++-v3/src/.libs -B[...]/hurd/master.build/i686-unknown-gnu0.7/libstdc++-v3/libsupc++/.libs -B[...]/hurd/master.build.install/i686-unknown-gnu0.7/bin/ -B[...]/hurd/master.build.install/i686-unknown-gnu0.7/lib/ -isystem [...]/hurd/master.build.install/i686-unknown-gnu0.7/include -isystem [...]/hurd/master.build.install/i686-unknown-gnu0.7/sys-include " "LD=[...]/hurd/master.build/./gcc/collect-ld" "NM=[...]/hurd/master.build/./gcc/nm" "RANLIB=ranlib" "DESTDIR=" \ CFLAGS="-g -O2 ${flags}" \ CCASFLAGS="-g -O2 ${flags}" \ FCFLAGS=" ${flags}" \ @@ -1320,114 +1318,114 @@ else \ fi; \ done; \ fi -make[4]: Leaving directory '[...]/hurd/master.build/i686-unknown-gnu0.6/libffi' -make[3]: Leaving directory '[...]/hurd/master.build/i686-unknown-gnu0.6/libffi' -make[2]: Leaving directory '[...]/hurd/master.build/i686-unknown-gnu0.6/libffi' -make[2]: Entering directory '[...]/hurd/master.build/i686-unknown-gnu0.6/libjava' +make[4]: Leaving directory '[...]/hurd/master.build/i686-unknown-gnu0.7/libffi' +make[3]: Leaving directory '[...]/hurd/master.build/i686-unknown-gnu0.7/libffi' +make[2]: Leaving directory '[...]/hurd/master.build/i686-unknown-gnu0.7/libffi' +make[2]: Entering directory '[...]/hurd/master.build/i686-unknown-gnu0.7/libjava' Making check in libltdl -make[3]: Entering directory '[...]/hurd/master.build/i686-unknown-gnu0.6/libjava/libltdl' +make[3]: Entering directory '[...]/hurd/master.build/i686-unknown-gnu0.7/libjava/libltdl' true DO=all multi-do # make -make[3]: Leaving directory '[...]/hurd/master.build/i686-unknown-gnu0.6/libjava/libltdl' +make[3]: Leaving directory '[...]/hurd/master.build/i686-unknown-gnu0.7/libjava/libltdl' Making check in gcj -make[3]: Entering directory '[...]/hurd/master.build/i686-unknown-gnu0.6/libjava/gcj' -make[3]: Leaving directory '[...]/hurd/master.build/i686-unknown-gnu0.6/libjava/gcj' +make[3]: Entering directory '[...]/hurd/master.build/i686-unknown-gnu0.7/libjava/gcj' +make[3]: Leaving directory '[...]/hurd/master.build/i686-unknown-gnu0.7/libjava/gcj' Making check in include -make[3]: Entering directory '[...]/hurd/master.build/i686-unknown-gnu0.6/libjava/include' -make[3]: Leaving directory '[...]/hurd/master.build/i686-unknown-gnu0.6/libjava/include' +make[3]: Entering directory '[...]/hurd/master.build/i686-unknown-gnu0.7/libjava/include' +make[3]: Leaving directory '[...]/hurd/master.build/i686-unknown-gnu0.7/libjava/include' Making check in classpath -make[3]: Entering directory '[...]/hurd/master.build/i686-unknown-gnu0.6/libjava/classpath' +make[3]: Entering directory '[...]/hurd/master.build/i686-unknown-gnu0.7/libjava/classpath' Making check in lib -make[4]: Entering directory '[...]/hurd/master.build/i686-unknown-gnu0.6/libjava/classpath/lib' +make[4]: Entering directory '[...]/hurd/master.build/i686-unknown-gnu0.7/libjava/classpath/lib' true top_builddir=.. top_srcdir=../../../../../master/libjava/classpath /bin/dash ./gen-classlist.sh standard Adding java source files from srcdir '[...]/hurd/master/libjava/classpath'. Adding java source files from VM directory [...]/hurd/master/libjava -Adding java source files from VM directory [...]/hurd/master.build/i686-unknown-gnu0.6/libjava +Adding java source files from VM directory [...]/hurd/master.build/i686-unknown-gnu0.7/libjava Adding generated files in builddir '..'. make[4]: Nothing to be done for 'check'. -make[4]: Leaving directory '[...]/hurd/master.build/i686-unknown-gnu0.6/libjava/classpath/lib' +make[4]: Leaving directory '[...]/hurd/master.build/i686-unknown-gnu0.7/libjava/classpath/lib' Making check in doc -make[4]: Entering directory '[...]/hurd/master.build/i686-unknown-gnu0.6/libjava/classpath/doc' +make[4]: Entering directory '[...]/hurd/master.build/i686-unknown-gnu0.7/libjava/classpath/doc' Making check in api -make[5]: Entering directory '[...]/hurd/master.build/i686-unknown-gnu0.6/libjava/classpath/doc/api' +make[5]: Entering directory '[...]/hurd/master.build/i686-unknown-gnu0.7/libjava/classpath/doc/api' make[5]: Nothing to be done for 'check'. -make[5]: Leaving directory '[...]/hurd/master.build/i686-unknown-gnu0.6/libjava/classpath/doc/api' -make[5]: Entering directory '[...]/hurd/master.build/i686-unknown-gnu0.6/libjava/classpath/doc' +make[5]: Leaving directory '[...]/hurd/master.build/i686-unknown-gnu0.7/libjava/classpath/doc/api' +make[5]: Entering directory '[...]/hurd/master.build/i686-unknown-gnu0.7/libjava/classpath/doc' make[5]: Nothing to be done for 'check-am'. -make[5]: Leaving directory '[...]/hurd/master.build/i686-unknown-gnu0.6/libjava/classpath/doc' -make[4]: Leaving directory '[...]/hurd/master.build/i686-unknown-gnu0.6/libjava/classpath/doc' +make[5]: Leaving directory '[...]/hurd/master.build/i686-unknown-gnu0.7/libjava/classpath/doc' +make[4]: Leaving directory '[...]/hurd/master.build/i686-unknown-gnu0.7/libjava/classpath/doc' Making check in external -make[4]: Entering directory '[...]/hurd/master.build/i686-unknown-gnu0.6/libjava/classpath/external' +make[4]: Entering directory '[...]/hurd/master.build/i686-unknown-gnu0.7/libjava/classpath/external' Making check in sax -make[5]: Entering directory '[...]/hurd/master.build/i686-unknown-gnu0.6/libjava/classpath/external/sax' +make[5]: Entering directory '[...]/hurd/master.build/i686-unknown-gnu0.7/libjava/classpath/external/sax' make[5]: Nothing to be done for 'check'. -make[5]: Leaving directory '[...]/hurd/master.build/i686-unknown-gnu0.6/libjava/classpath/external/sax' +make[5]: Leaving directory '[...]/hurd/master.build/i686-unknown-gnu0.7/libjava/classpath/external/sax' Making check in w3c_dom -make[5]: Entering directory '[...]/hurd/master.build/i686-unknown-gnu0.6/libjava/classpath/external/w3c_dom' +make[5]: Entering directory '[...]/hurd/master.build/i686-unknown-gnu0.7/libjava/classpath/external/w3c_dom' make[5]: Nothing to be done for 'check'. -make[5]: Leaving directory '[...]/hurd/master.build/i686-unknown-gnu0.6/libjava/classpath/external/w3c_dom' +make[5]: Leaving directory '[...]/hurd/master.build/i686-unknown-gnu0.7/libjava/classpath/external/w3c_dom' Making check in relaxngDatatype -make[5]: Entering directory '[...]/hurd/master.build/i686-unknown-gnu0.6/libjava/classpath/external/relaxngDatatype' +make[5]: Entering directory '[...]/hurd/master.build/i686-unknown-gnu0.7/libjava/classpath/external/relaxngDatatype' make[5]: Nothing to be done for 'check'. -make[5]: Leaving directory '[...]/hurd/master.build/i686-unknown-gnu0.6/libjava/classpath/external/relaxngDatatype' +make[5]: Leaving directory '[...]/hurd/master.build/i686-unknown-gnu0.7/libjava/classpath/external/relaxngDatatype' Making check in jsr166 -make[5]: Entering directory '[...]/hurd/master.build/i686-unknown-gnu0.6/libjava/classpath/external/jsr166' +make[5]: Entering directory '[...]/hurd/master.build/i686-unknown-gnu0.7/libjava/classpath/external/jsr166' make[5]: Nothing to be done for 'check'. -make[5]: Leaving directory '[...]/hurd/master.build/i686-unknown-gnu0.6/libjava/classpath/external/jsr166' -make[5]: Entering directory '[...]/hurd/master.build/i686-unknown-gnu0.6/libjava/classpath/external' +make[5]: Leaving directory '[...]/hurd/master.build/i686-unknown-gnu0.7/libjava/classpath/external/jsr166' +make[5]: Entering directory '[...]/hurd/master.build/i686-unknown-gnu0.7/libjava/classpath/external' make[5]: Nothing to be done for 'check-am'. -make[5]: Leaving directory '[...]/hurd/master.build/i686-unknown-gnu0.6/libjava/classpath/external' -make[4]: Leaving directory '[...]/hurd/master.build/i686-unknown-gnu0.6/libjava/classpath/external' +make[5]: Leaving directory '[...]/hurd/master.build/i686-unknown-gnu0.7/libjava/classpath/external' +make[4]: Leaving directory '[...]/hurd/master.build/i686-unknown-gnu0.7/libjava/classpath/external' Making check in include -make[4]: Entering directory '[...]/hurd/master.build/i686-unknown-gnu0.6/libjava/classpath/include' -make[4]: Leaving directory '[...]/hurd/master.build/i686-unknown-gnu0.6/libjava/classpath/include' +make[4]: Entering directory '[...]/hurd/master.build/i686-unknown-gnu0.7/libjava/classpath/include' +make[4]: Leaving directory '[...]/hurd/master.build/i686-unknown-gnu0.7/libjava/classpath/include' Making check in native -make[4]: Entering directory '[...]/hurd/master.build/i686-unknown-gnu0.6/libjava/classpath/native' +make[4]: Entering directory '[...]/hurd/master.build/i686-unknown-gnu0.7/libjava/classpath/native' Making check in fdlibm -make[5]: Entering directory '[...]/hurd/master.build/i686-unknown-gnu0.6/libjava/classpath/native/fdlibm' +make[5]: Entering directory '[...]/hurd/master.build/i686-unknown-gnu0.7/libjava/classpath/native/fdlibm' make[5]: Nothing to be done for 'check'. -make[5]: Leaving directory '[...]/hurd/master.build/i686-unknown-gnu0.6/libjava/classpath/native/fdlibm' +make[5]: Leaving directory '[...]/hurd/master.build/i686-unknown-gnu0.7/libjava/classpath/native/fdlibm' Making check in jni -make[5]: Entering directory '[...]/hurd/master.build/i686-unknown-gnu0.6/libjava/classpath/native/jni' +make[5]: Entering directory '[...]/hurd/master.build/i686-unknown-gnu0.7/libjava/classpath/native/jni' Making check in classpath -make[6]: Entering directory '[...]/hurd/master.build/i686-unknown-gnu0.6/libjava/classpath/native/jni/classpath' +make[6]: Entering directory '[...]/hurd/master.build/i686-unknown-gnu0.7/libjava/classpath/native/jni/classpath' make[6]: Nothing to be done for 'check'. -make[6]: Leaving directory '[...]/hurd/master.build/i686-unknown-gnu0.6/libjava/classpath/native/jni/classpath' +make[6]: Leaving directory '[...]/hurd/master.build/i686-unknown-gnu0.7/libjava/classpath/native/jni/classpath' Making check in java-math -make[6]: Entering directory '[...]/hurd/master.build/i686-unknown-gnu0.6/libjava/classpath/native/jni/java-math' +make[6]: Entering directory '[...]/hurd/master.build/i686-unknown-gnu0.7/libjava/classpath/native/jni/java-math' make[6]: Nothing to be done for 'check'. -make[6]: Leaving directory '[...]/hurd/master.build/i686-unknown-gnu0.6/libjava/classpath/native/jni/java-math' -make[6]: Entering directory '[...]/hurd/master.build/i686-unknown-gnu0.6/libjava/classpath/native/jni' +make[6]: Leaving directory '[...]/hurd/master.build/i686-unknown-gnu0.7/libjava/classpath/native/jni/java-math' +make[6]: Entering directory '[...]/hurd/master.build/i686-unknown-gnu0.7/libjava/classpath/native/jni' /bin/dash ../../scripts/check_jni_methods.sh -make[6]: Leaving directory '[...]/hurd/master.build/i686-unknown-gnu0.6/libjava/classpath/native/jni' -make[5]: Leaving directory '[...]/hurd/master.build/i686-unknown-gnu0.6/libjava/classpath/native/jni' -make[5]: Entering directory '[...]/hurd/master.build/i686-unknown-gnu0.6/libjava/classpath/native' +make[6]: Leaving directory '[...]/hurd/master.build/i686-unknown-gnu0.7/libjava/classpath/native/jni' +make[5]: Leaving directory '[...]/hurd/master.build/i686-unknown-gnu0.7/libjava/classpath/native/jni' +make[5]: Entering directory '[...]/hurd/master.build/i686-unknown-gnu0.7/libjava/classpath/native' make[5]: Nothing to be done for 'check-am'. -make[5]: Leaving directory '[...]/hurd/master.build/i686-unknown-gnu0.6/libjava/classpath/native' -make[4]: Leaving directory '[...]/hurd/master.build/i686-unknown-gnu0.6/libjava/classpath/native' +make[5]: Leaving directory '[...]/hurd/master.build/i686-unknown-gnu0.7/libjava/classpath/native' +make[4]: Leaving directory '[...]/hurd/master.build/i686-unknown-gnu0.7/libjava/classpath/native' Making check in resource -make[4]: Entering directory '[...]/hurd/master.build/i686-unknown-gnu0.6/libjava/classpath/resource' +make[4]: Entering directory '[...]/hurd/master.build/i686-unknown-gnu0.7/libjava/classpath/resource' make[4]: Nothing to be done for 'check'. -make[4]: Leaving directory '[...]/hurd/master.build/i686-unknown-gnu0.6/libjava/classpath/resource' +make[4]: Leaving directory '[...]/hurd/master.build/i686-unknown-gnu0.7/libjava/classpath/resource' Making check in scripts -make[4]: Entering directory '[...]/hurd/master.build/i686-unknown-gnu0.6/libjava/classpath/scripts' +make[4]: Entering directory '[...]/hurd/master.build/i686-unknown-gnu0.7/libjava/classpath/scripts' make[4]: Nothing to be done for 'check'. -make[4]: Leaving directory '[...]/hurd/master.build/i686-unknown-gnu0.6/libjava/classpath/scripts' +make[4]: Leaving directory '[...]/hurd/master.build/i686-unknown-gnu0.7/libjava/classpath/scripts' Making check in tools -make[4]: Entering directory '[...]/hurd/master.build/i686-unknown-gnu0.6/libjava/classpath/tools' +make[4]: Entering directory '[...]/hurd/master.build/i686-unknown-gnu0.7/libjava/classpath/tools' make check-am -make[5]: Entering directory '[...]/hurd/master.build/i686-unknown-gnu0.6/libjava/classpath/tools' +make[5]: Entering directory '[...]/hurd/master.build/i686-unknown-gnu0.7/libjava/classpath/tools' make[5]: Nothing to be done for 'check-am'. -make[5]: Leaving directory '[...]/hurd/master.build/i686-unknown-gnu0.6/libjava/classpath/tools' -make[4]: Leaving directory '[...]/hurd/master.build/i686-unknown-gnu0.6/libjava/classpath/tools' -make[4]: Entering directory '[...]/hurd/master.build/i686-unknown-gnu0.6/libjava/classpath' +make[5]: Leaving directory '[...]/hurd/master.build/i686-unknown-gnu0.7/libjava/classpath/tools' +make[4]: Leaving directory '[...]/hurd/master.build/i686-unknown-gnu0.7/libjava/classpath/tools' +make[4]: Entering directory '[...]/hurd/master.build/i686-unknown-gnu0.7/libjava/classpath' true DO=all multi-do # make -make[4]: Leaving directory '[...]/hurd/master.build/i686-unknown-gnu0.6/libjava/classpath' -make[3]: Leaving directory '[...]/hurd/master.build/i686-unknown-gnu0.6/libjava/classpath' +make[4]: Leaving directory '[...]/hurd/master.build/i686-unknown-gnu0.7/libjava/classpath' +make[3]: Leaving directory '[...]/hurd/master.build/i686-unknown-gnu0.7/libjava/classpath' Making check in testsuite -make[3]: Entering directory '[...]/hurd/master.build/i686-unknown-gnu0.6/libjava/testsuite' +make[3]: Entering directory '[...]/hurd/master.build/i686-unknown-gnu0.7/libjava/testsuite' make check-DEJAGNU -make[4]: Entering directory '[...]/hurd/master.build/i686-unknown-gnu0.6/libjava/testsuite' +make[4]: Entering directory '[...]/hurd/master.build/i686-unknown-gnu0.7/libjava/testsuite' Making a new site.exp file... srcdir='../../../../master/libjava/testsuite'; export srcdir; \ EXPECT=`if [ -f ../../expect/expect ] ; then echo ../../expect/expect ; else echo expect ; fi`; export EXPECT; \ @@ -1440,8 +1438,8 @@ if /bin/dash -c "$runtest --version" > /dev/null 2>&1; then \ else echo "WARNING: could not find \`runtest'" 1>&2; :;\ fi; \ exit $exit_status -Test Run By thomas on Wed Apr 20 09:40:42 2016 -Native configuration is i686-unknown-gnu0.6 +Test Run By thomas on Fri May 20 02:12:51 2016 +Native configuration is i686-unknown-gnu0.7 === libjava tests === @@ -1456,9 +1454,9 @@ Running ../../../../master/libjava/testsuite/libjava.cni/cni.exp ... Running ../../../../master/libjava/testsuite/libjava.jar/jar.exp ... Running ../../../../master/libjava/testsuite/libjava.jni/jni.exp ... Running ../../../../master/libjava/testsuite/libjava.jvmti/jvmti-interp.exp ... -LD_LIBRARY_PATH=. [...]/hurd/master.build/i686-unknown-gnu0.6/./libjava/gij -cp ../../../../master/libjava/testsuite/libjava.jvmti/interp/getargssize.jar -agentlib:dummyagent getargssize -LD_LIBRARY_PATH=. [...]/hurd/master.build/i686-unknown-gnu0.6/./libjava/gij -cp ../../../../master/libjava/testsuite/libjava.jvmti/interp/getlocalvartable.jar -agentlib:dummyagent getlocalvartable -LD_LIBRARY_PATH=. [...]/hurd/master.build/i686-unknown-gnu0.6/./libjava/gij -cp ../../../../master/libjava/testsuite/libjava.jvmti/interp/getstacktrace.jar -agentlib:dummyagent getstacktrace +LD_LIBRARY_PATH=. [...]/hurd/master.build/i686-unknown-gnu0.7/./libjava/gij -cp ../../../../master/libjava/testsuite/libjava.jvmti/interp/getargssize.jar -agentlib:dummyagent getargssize +LD_LIBRARY_PATH=. [...]/hurd/master.build/i686-unknown-gnu0.7/./libjava/gij -cp ../../../../master/libjava/testsuite/libjava.jvmti/interp/getlocalvartable.jar -agentlib:dummyagent getlocalvartable +LD_LIBRARY_PATH=. [...]/hurd/master.build/i686-unknown-gnu0.7/./libjava/gij -cp ../../../../master/libjava/testsuite/libjava.jvmti/interp/getstacktrace.jar -agentlib:dummyagent getstacktrace Running ../../../../master/libjava/testsuite/libjava.jvmti/jvmti.exp ... Running ../../../../master/libjava/testsuite/libjava.lang/lang.exp ... FAIL: Throw_2 execution - source compiled test @@ -1478,21 +1476,21 @@ Running ../../../../master/libjava/testsuite/libjava.verify/verify.exp ... # of untested testcases 4 Makefile:409: recipe for target 'check-DEJAGNU' failed make[4]: *** [check-DEJAGNU] Error 1 -make[4]: Leaving directory '[...]/hurd/master.build/i686-unknown-gnu0.6/libjava/testsuite' +make[4]: Leaving directory '[...]/hurd/master.build/i686-unknown-gnu0.7/libjava/testsuite' Makefile:427: recipe for target 'check-am' failed make[3]: *** [check-am] Error 2 make[3]: Target 'check' not remade because of errors. -make[3]: Leaving directory '[...]/hurd/master.build/i686-unknown-gnu0.6/libjava/testsuite' -make[3]: Entering directory '[...]/hurd/master.build/i686-unknown-gnu0.6/libjava' +make[3]: Leaving directory '[...]/hurd/master.build/i686-unknown-gnu0.7/libjava/testsuite' +make[3]: Entering directory '[...]/hurd/master.build/i686-unknown-gnu0.7/libjava' : make ; exec make "AR_FLAGS=rc" "CC_FOR_BUILD=gcc-4.9" "CFLAGS=-g -O2" "CXXFLAGS=-g -O2 -D_GNU_SOURCE" "CPPFLAGS=" "CFLAGS_FOR_BUILD=-g -O2" "CFLAGS_FOR_TARGET=-g -O2" "INSTALL=/usr/bin/install -c" "INSTALL_DATA=/usr/bin/install -c -m 644" "INSTALL_PROGRAM=/usr/bin/install -c" "INSTALL_SCRIPT=/usr/bin/install -c" "GCJFLAGS=-g -O2" "LDFLAGS=" "LIBCFLAGS=-g -O2" "LIBCFLAGS_FOR_TARGET=-g -O2" "MAKE=make" "MAKEINFO=makeinfo --split-size=5000000 --split-size=5000000 " "PICFLAG=" "PICFLAG_FOR_TARGET=" "SHELL=/bin/dash" "RUNTESTFLAGS=" "exec_prefix=[...]/hurd/master.build.install" "datadir=[...]/hurd/master.build.install/share" "infodir=[...]/hurd/master.build.install/share/info" "libdir=[...]/hurd/master.build.install/lib" "mandir=[...]/hurd/master.build.install/share/man" "prefix=[...]/hurd/master.build.install" "gxx_include_dir=[...]/hurd/master.build.install/include/c++/6.0.0" "AR=ar" "AS=[...]/hurd/master.build/./gcc/as" "DLLTOOL=dlltool" "LD=[...]/hurd/master.build/./gcc/collect-ld" "LIBCFLAGS=-g -O2" "NM=[...]/hurd/master.build/./gcc/nm" "PICFLAG=" "RANLIB=ranlib" "DESTDIR=" "JAR=jar" DO=all multi-do -make[4]: Entering directory '[...]/hurd/master.build/i686-unknown-gnu0.6/libjava' +make[4]: Entering directory '[...]/hurd/master.build/i686-unknown-gnu0.7/libjava' if [ -z "" ]; then \ true; \ else \ rootpre=`${PWDCMD-pwd}`/; export rootpre; \ srcrootpre=`cd ../../../master/libjava; ${PWDCMD-pwd}`/; export srcrootpre; \ lib=`echo "${rootpre}" | sed -e 's,^.*/\([^/][^/]*\)/$,\1,'`; \ - compiler="[...]/hurd/master.build/./gcc/xgcc -B[...]/hurd/master.build/./gcc/ -B[...]/hurd/master.build.install/i686-unknown-gnu0.6/bin/ -B[...]/hurd/master.build.install/i686-unknown-gnu0.6/lib/ -isystem [...]/hurd/master.build.install/i686-unknown-gnu0.6/include -isystem [...]/hurd/master.build.install/i686-unknown-gnu0.6/sys-include "; \ + compiler="[...]/hurd/master.build/./gcc/xgcc -B[...]/hurd/master.build/./gcc/ -B[...]/hurd/master.build.install/i686-unknown-gnu0.7/bin/ -B[...]/hurd/master.build.install/i686-unknown-gnu0.7/lib/ -isystem [...]/hurd/master.build.install/i686-unknown-gnu0.7/include -isystem [...]/hurd/master.build.install/i686-unknown-gnu0.7/sys-include "; \ for i in `${compiler} --print-multi-lib 2>/dev/null`; do \ dir=`echo $i | sed -e 's/;.*$//'`; \ if [ "${dir}" = "." ]; then \ @@ -1530,25 +1528,25 @@ else \ fi; \ done; \ fi -make[4]: Leaving directory '[...]/hurd/master.build/i686-unknown-gnu0.6/libjava' -make[3]: Leaving directory '[...]/hurd/master.build/i686-unknown-gnu0.6/libjava' +make[4]: Leaving directory '[...]/hurd/master.build/i686-unknown-gnu0.7/libjava' +make[3]: Leaving directory '[...]/hurd/master.build/i686-unknown-gnu0.7/libjava' Makefile:10281: recipe for target 'check-recursive' failed make[2]: *** [check-recursive] Error 1 make[2]: Target 'check' not remade because of errors. -make[2]: Leaving directory '[...]/hurd/master.build/i686-unknown-gnu0.6/libjava' +make[2]: Leaving directory '[...]/hurd/master.build/i686-unknown-gnu0.7/libjava' Makefile:18556: recipe for target 'check-target-libjava' failed make[1]: *** [check-target-libjava] Error 2 -make[2]: Entering directory '[...]/hurd/master.build/i686-unknown-gnu0.6/zlib' +make[2]: Entering directory '[...]/hurd/master.build/i686-unknown-gnu0.7/zlib' make[2]: Nothing to be done for 'check'. -make[2]: Leaving directory '[...]/hurd/master.build/i686-unknown-gnu0.6/zlib' -make[2]: Entering directory '[...]/hurd/master.build/i686-unknown-gnu0.6/boehm-gc' +make[2]: Leaving directory '[...]/hurd/master.build/i686-unknown-gnu0.7/zlib' +make[2]: Entering directory '[...]/hurd/master.build/i686-unknown-gnu0.7/boehm-gc' Making check in include -make[3]: Entering directory '[...]/hurd/master.build/i686-unknown-gnu0.6/boehm-gc/include' -make[3]: Leaving directory '[...]/hurd/master.build/i686-unknown-gnu0.6/boehm-gc/include' +make[3]: Entering directory '[...]/hurd/master.build/i686-unknown-gnu0.7/boehm-gc/include' +make[3]: Leaving directory '[...]/hurd/master.build/i686-unknown-gnu0.7/boehm-gc/include' Making check in testsuite -make[3]: Entering directory '[...]/hurd/master.build/i686-unknown-gnu0.6/boehm-gc/testsuite' +make[3]: Entering directory '[...]/hurd/master.build/i686-unknown-gnu0.7/boehm-gc/testsuite' make check-DEJAGNU -make[4]: Entering directory '[...]/hurd/master.build/i686-unknown-gnu0.6/boehm-gc/testsuite' +make[4]: Entering directory '[...]/hurd/master.build/i686-unknown-gnu0.7/boehm-gc/testsuite' Making a new site.exp file... srcdir='../../../../master/boehm-gc/testsuite'; export srcdir; \ EXPECT=expect; export EXPECT; \ @@ -1561,8 +1559,8 @@ if /bin/dash -c "$runtest --version" > /dev/null 2>&1; then \ else echo "WARNING: could not find \`runtest'" 1>&2; :;\ fi; \ exit $exit_status -Test Run By thomas on Wed Apr 20 10:01:44 2016 -Native configuration is i686-unknown-gnu0.6 +Test Run By thomas on Fri May 20 02:34:25 2016 +Native configuration is i686-unknown-gnu0.7 === boehm-gc tests === @@ -1580,18 +1578,18 @@ Running ../../../../master/boehm-gc/testsuite/boehm-gc.lib/lib.exp ... # of expected passes 12 # of unsupported tests 1 -make[4]: Leaving directory '[...]/hurd/master.build/i686-unknown-gnu0.6/boehm-gc/testsuite' -make[3]: Leaving directory '[...]/hurd/master.build/i686-unknown-gnu0.6/boehm-gc/testsuite' -make[3]: Entering directory '[...]/hurd/master.build/i686-unknown-gnu0.6/boehm-gc' -make "AR_FLAGS=rc" "CC_FOR_BUILD=gcc-4.9" "CFLAGS=-g -O2 " "CXXFLAGS=-g -O2 -D_GNU_SOURCE" "CFLAGS_FOR_BUILD=-g -O2" "CFLAGS_FOR_TARGET=-g -O2" "INSTALL=/usr/bin/install -c" "INSTALL_DATA=/usr/bin/install -c -m 644" "INSTALL_PROGRAM=/usr/bin/install -c" "INSTALL_SCRIPT=/usr/bin/install -c" "LDFLAGS=" "LIBCFLAGS=-g -O2" "LIBCFLAGS_FOR_TARGET=-g -O2" "MAKE=make" "MAKEINFO=makeinfo --split-size=5000000 --split-size=5000000 " "PICFLAG=" "PICFLAG_FOR_TARGET=" "SHELL=/bin/dash" "EXPECT=expect" "RUNTEST=runtest" "RUNTESTFLAGS=" "exec_prefix=[...]/hurd/master.build.install" "infodir=[...]/hurd/master.build.install/share/info" "libdir=[...]/hurd/master.build.install/lib" "prefix=[...]/hurd/master.build.install" "tooldir=[...]/hurd/master.build.install/i686-unknown-gnu0.6" "AR=ar" "AS=[...]/hurd/master.build/./gcc/as" "CC=[...]/hurd/master.build/./gcc/xgcc -B[...]/hurd/master.build/./gcc/ -B[...]/hurd/master.build.install/i686-unknown-gnu0.6/bin/ -B[...]/hurd/master.build.install/i686-unknown-gnu0.6/lib/ -isystem [...]/hurd/master.build.install/i686-unknown-gnu0.6/include -isystem [...]/hurd/master.build.install/i686-unknown-gnu0.6/sys-include " "CXX=[...]/hurd/master.build/./gcc/xg++ -B[...]/hurd/master.build/./gcc/ -nostdinc++ -nostdinc++ -I[...]/hurd/master.build/i686-unknown-gnu0.6/libstdc++-v3/include/i686-unknown-gnu0.6 -I[...]/hurd/master.build/i686-unknown-gnu0.6/libstdc++-v3/include -I[...]/hurd/master/libstdc++-v3/libsupc++ -I[...]/hurd/master/libstdc++-v3/include/backward -I[...]/hurd/master/libstdc++-v3/testsuite/util -L[...]/hurd/master.build/i686-unknown-gnu0.6/libstdc++-v3/src -L[...]/hurd/master.build/i686-unknown-gnu0.6/libstdc++-v3/src/.libs -L[...]/hurd/master.build/i686-unknown-gnu0.6/libstdc++-v3/libsupc++/.libs -B[...]/hurd/master.build/i686-unknown-gnu0.6/libstdc++-v3/src/.libs -B[...]/hurd/master.build/i686-unknown-gnu0.6/libstdc++-v3/libsupc++/.libs -B[...]/hurd/master.build.install/i686-unknown-gnu0.6/bin/ -B[...]/hurd/master.build.install/i686-unknown-gnu0.6/lib/ -isystem [...]/hurd/master.build.install/i686-unknown-gnu0.6/include -isystem [...]/hurd/master.build.install/i686-unknown-gnu0.6/sys-include " "LD=[...]/hurd/master.build/./gcc/collect-ld" "LIBCFLAGS=-g -O2" "NM=[...]/hurd/master.build/./gcc/nm" "PICFLAG=" "RANLIB=ranlib" "DESTDIR=" DO=all multi-do # make -make[4]: Entering directory '[...]/hurd/master.build/i686-unknown-gnu0.6/boehm-gc' +make[4]: Leaving directory '[...]/hurd/master.build/i686-unknown-gnu0.7/boehm-gc/testsuite' +make[3]: Leaving directory '[...]/hurd/master.build/i686-unknown-gnu0.7/boehm-gc/testsuite' +make[3]: Entering directory '[...]/hurd/master.build/i686-unknown-gnu0.7/boehm-gc' +make "AR_FLAGS=rc" "CC_FOR_BUILD=gcc-4.9" "CFLAGS=-g -O2 " "CXXFLAGS=-g -O2 -D_GNU_SOURCE" "CFLAGS_FOR_BUILD=-g -O2" "CFLAGS_FOR_TARGET=-g -O2" "INSTALL=/usr/bin/install -c" "INSTALL_DATA=/usr/bin/install -c -m 644" "INSTALL_PROGRAM=/usr/bin/install -c" "INSTALL_SCRIPT=/usr/bin/install -c" "LDFLAGS=" "LIBCFLAGS=-g -O2" "LIBCFLAGS_FOR_TARGET=-g -O2" "MAKE=make" "MAKEINFO=makeinfo --split-size=5000000 --split-size=5000000 " "PICFLAG=" "PICFLAG_FOR_TARGET=" "SHELL=/bin/dash" "EXPECT=expect" "RUNTEST=runtest" "RUNTESTFLAGS=" "exec_prefix=[...]/hurd/master.build.install" "infodir=[...]/hurd/master.build.install/share/info" "libdir=[...]/hurd/master.build.install/lib" "prefix=[...]/hurd/master.build.install" "tooldir=[...]/hurd/master.build.install/i686-unknown-gnu0.7" "AR=ar" "AS=[...]/hurd/master.build/./gcc/as" "CC=[...]/hurd/master.build/./gcc/xgcc -B[...]/hurd/master.build/./gcc/ -B[...]/hurd/master.build.install/i686-unknown-gnu0.7/bin/ -B[...]/hurd/master.build.install/i686-unknown-gnu0.7/lib/ -isystem [...]/hurd/master.build.install/i686-unknown-gnu0.7/include -isystem [...]/hurd/master.build.install/i686-unknown-gnu0.7/sys-include " "CXX=[...]/hurd/master.build/./gcc/xg++ -B[...]/hurd/master.build/./gcc/ -nostdinc++ -nostdinc++ -I[...]/hurd/master.build/i686-unknown-gnu0.7/libstdc++-v3/include/i686-unknown-gnu0.7 -I[...]/hurd/master.build/i686-unknown-gnu0.7/libstdc++-v3/include -I[...]/hurd/master/libstdc++-v3/libsupc++ -I[...]/hurd/master/libstdc++-v3/include/backward -I[...]/hurd/master/libstdc++-v3/testsuite/util -L[...]/hurd/master.build/i686-unknown-gnu0.7/libstdc++-v3/src -L[...]/hurd/master.build/i686-unknown-gnu0.7/libstdc++-v3/src/.libs -L[...]/hurd/master.build/i686-unknown-gnu0.7/libstdc++-v3/libsupc++/.libs -B[...]/hurd/master.build/i686-unknown-gnu0.7/libstdc++-v3/src/.libs -B[...]/hurd/master.build/i686-unknown-gnu0.7/libstdc++-v3/libsupc++/.libs -B[...]/hurd/master.build.install/i686-unknown-gnu0.7/bin/ -B[...]/hurd/master.build.install/i686-unknown-gnu0.7/lib/ -isystem [...]/hurd/master.build.install/i686-unknown-gnu0.7/include -isystem [...]/hurd/master.build.install/i686-unknown-gnu0.7/sys-include " "LD=[...]/hurd/master.build/./gcc/collect-ld" "LIBCFLAGS=-g -O2" "NM=[...]/hurd/master.build/./gcc/nm" "PICFLAG=" "RANLIB=ranlib" "DESTDIR=" DO=all multi-do # make +make[4]: Entering directory '[...]/hurd/master.build/i686-unknown-gnu0.7/boehm-gc' if [ -z "" ]; then \ true; \ else \ rootpre=`${PWDCMD-pwd}`/; export rootpre; \ srcrootpre=`cd ../../../master/boehm-gc; ${PWDCMD-pwd}`/; export srcrootpre; \ lib=`echo "${rootpre}" | sed -e 's,^.*/\([^/][^/]*\)/$,\1,'`; \ - compiler="[...]/hurd/master.build/./gcc/xgcc -B[...]/hurd/master.build/./gcc/ -B[...]/hurd/master.build.install/i686-unknown-gnu0.6/bin/ -B[...]/hurd/master.build.install/i686-unknown-gnu0.6/lib/ -isystem [...]/hurd/master.build.install/i686-unknown-gnu0.6/include -isystem [...]/hurd/master.build.install/i686-unknown-gnu0.6/sys-include "; \ + compiler="[...]/hurd/master.build/./gcc/xgcc -B[...]/hurd/master.build/./gcc/ -B[...]/hurd/master.build.install/i686-unknown-gnu0.7/bin/ -B[...]/hurd/master.build.install/i686-unknown-gnu0.7/lib/ -isystem [...]/hurd/master.build.install/i686-unknown-gnu0.7/include -isystem [...]/hurd/master.build.install/i686-unknown-gnu0.7/sys-include "; \ for i in `${compiler} --print-multi-lib 2>/dev/null`; do \ dir=`echo $i | sed -e 's/;.*$//'`; \ if [ "${dir}" = "." ]; then \ @@ -1629,14 +1627,14 @@ else \ fi; \ done; \ fi -make[4]: Leaving directory '[...]/hurd/master.build/i686-unknown-gnu0.6/boehm-gc' -make[3]: Leaving directory '[...]/hurd/master.build/i686-unknown-gnu0.6/boehm-gc' -make[2]: Leaving directory '[...]/hurd/master.build/i686-unknown-gnu0.6/boehm-gc' -make[2]: Entering directory '[...]/hurd/master.build/i686-unknown-gnu0.6/libgomp' +make[4]: Leaving directory '[...]/hurd/master.build/i686-unknown-gnu0.7/boehm-gc' +make[3]: Leaving directory '[...]/hurd/master.build/i686-unknown-gnu0.7/boehm-gc' +make[2]: Leaving directory '[...]/hurd/master.build/i686-unknown-gnu0.7/boehm-gc' +make[2]: Entering directory '[...]/hurd/master.build/i686-unknown-gnu0.7/libgomp' Making check in testsuite -make[3]: Entering directory '[...]/hurd/master.build/i686-unknown-gnu0.6/libgomp/testsuite' +make[3]: Entering directory '[...]/hurd/master.build/i686-unknown-gnu0.7/libgomp/testsuite' make check-DEJAGNU -make[4]: Entering directory '[...]/hurd/master.build/i686-unknown-gnu0.6/libgomp/testsuite' +make[4]: Entering directory '[...]/hurd/master.build/i686-unknown-gnu0.7/libgomp/testsuite' Making a new site.exp file... srcdir='../../../../master/libgomp/testsuite'; export srcdir; \ EXPECT=expect; export EXPECT; \ @@ -1649,8 +1647,8 @@ if /bin/dash -c "$runtest --version" > /dev/null 2>&1; then \ else echo "WARNING: could not find \`runtest'" 1>&2; :;\ fi; \ exit $exit_status -Test Run By thomas on Wed Apr 20 10:02:00 2016 -Native configuration is i686-unknown-gnu0.6 +Test Run By thomas on Fri May 20 02:34:39 2016 +Native configuration is i686-unknown-gnu0.7 === libgomp tests === @@ -1662,16 +1660,17 @@ Using /usr/share/dejagnu/baseboards/unix.exp as board description file for targe Using /usr/share/dejagnu/config/unix.exp as generic interface file for target. Using ../../../../master/libgomp/testsuite/config/default.exp as tool-and-target-specific interface file. Running ../../../../master/libgomp/testsuite/libgomp.c/c.exp ... +FAIL: libgomp.c/lib-1.c execution test Running ../../../../master/libgomp/testsuite/libgomp.c++/c++.exp ... Running ../../../../master/libgomp/testsuite/libgomp.fortran/fortran.exp ... FAIL: libgomp.fortran/lib1.f90 -O1 execution test -FAIL: libgomp.fortran/lib1.f90 -O3 -fomit-frame-pointer -funroll-loops -fpeel-loops -ftracer -finline-functions execution test +FAIL: libgomp.fortran/lib1.f90 -O3 -g execution test FAIL: libgomp.fortran/lib1.f90 -Os execution test FAIL: libgomp.fortran/lib2.f -O1 execution test FAIL: libgomp.fortran/lib2.f -O2 execution test -FAIL: libgomp.fortran/lib3.f -O1 execution test +FAIL: libgomp.fortran/lib2.f -Os execution test FAIL: libgomp.fortran/lib3.f -O2 execution test -FAIL: libgomp.fortran/lib3.f -O3 -fomit-frame-pointer -funroll-loops -fpeel-loops -ftracer -finline-functions execution test +FAIL: libgomp.fortran/lib3.f -Os execution test Running ../../../../master/libgomp/testsuite/libgomp.graphite/graphite.exp ... Running ../../../../master/libgomp/testsuite/libgomp.hsa.c/c.exp ... Running ../../../../master/libgomp/testsuite/libgomp.oacc-c/c.exp ... @@ -1680,26 +1679,26 @@ Running ../../../../master/libgomp/testsuite/libgomp.oacc-fortran/fortran.exp .. === libgomp Summary === -# of expected passes 5044 -# of unexpected failures 8 +# of expected passes 5043 +# of unexpected failures 9 # of unsupported tests 271 Makefile:306: recipe for target 'check-DEJAGNU' failed make[4]: *** [check-DEJAGNU] Error 1 -make[4]: Leaving directory '[...]/hurd/master.build/i686-unknown-gnu0.6/libgomp/testsuite' +make[4]: Leaving directory '[...]/hurd/master.build/i686-unknown-gnu0.7/libgomp/testsuite' Makefile:350: recipe for target 'check-am' failed make[3]: *** [check-am] Error 2 make[3]: Target 'check' not remade because of errors. -make[3]: Leaving directory '[...]/hurd/master.build/i686-unknown-gnu0.6/libgomp/testsuite' -make[3]: Entering directory '[...]/hurd/master.build/i686-unknown-gnu0.6/libgomp' +make[3]: Leaving directory '[...]/hurd/master.build/i686-unknown-gnu0.7/libgomp/testsuite' +make[3]: Entering directory '[...]/hurd/master.build/i686-unknown-gnu0.7/libgomp' make DO=all multi-do # make -make[4]: Entering directory '[...]/hurd/master.build/i686-unknown-gnu0.6/libgomp' +make[4]: Entering directory '[...]/hurd/master.build/i686-unknown-gnu0.7/libgomp' if [ -z "" ]; then \ true; \ else \ rootpre=`${PWDCMD-pwd}`/; export rootpre; \ srcrootpre=`cd ../../../master/libgomp; ${PWDCMD-pwd}`/; export srcrootpre; \ lib=`echo "${rootpre}" | sed -e 's,^.*/\([^/][^/]*\)/$,\1,'`; \ - compiler="[...]/hurd/master.build/./gcc/xgcc -B[...]/hurd/master.build/./gcc/ -B[...]/hurd/master.build.install/i686-unknown-gnu0.6/bin/ -B[...]/hurd/master.build.install/i686-unknown-gnu0.6/lib/ -isystem [...]/hurd/master.build.install/i686-unknown-gnu0.6/include -isystem [...]/hurd/master.build.install/i686-unknown-gnu0.6/sys-include "; \ + compiler="[...]/hurd/master.build/./gcc/xgcc -B[...]/hurd/master.build/./gcc/ -B[...]/hurd/master.build.install/i686-unknown-gnu0.7/bin/ -B[...]/hurd/master.build.install/i686-unknown-gnu0.7/lib/ -isystem [...]/hurd/master.build.install/i686-unknown-gnu0.7/include -isystem [...]/hurd/master.build.install/i686-unknown-gnu0.7/sys-include "; \ for i in `${compiler} --print-multi-lib 2>/dev/null`; do \ dir=`echo $i | sed -e 's/;.*$//'`; \ if [ "${dir}" = "." ]; then \ @@ -1737,20 +1736,19 @@ else \ fi; \ done; \ fi -make[4]: Leaving directory '[...]/hurd/master.build/i686-unknown-gnu0.6/libgomp' -: -make[3]: Leaving directory '[...]/hurd/master.build/i686-unknown-gnu0.6/libgomp' +make[4]: Leaving directory '[...]/hurd/master.build/i686-unknown-gnu0.7/libgomp' +make[3]: Leaving directory '[...]/hurd/master.build/i686-unknown-gnu0.7/libgomp' Makefile:898: recipe for target 'check-recursive' failed make[2]: *** [check-recursive] Error 1 make[2]: Target 'check' not remade because of errors. -make[2]: Leaving directory '[...]/hurd/master.build/i686-unknown-gnu0.6/libgomp' +make[2]: Leaving directory '[...]/hurd/master.build/i686-unknown-gnu0.7/libgomp' Makefile:20444: recipe for target 'check-target-libgomp' failed make[1]: *** [check-target-libgomp] Error 2 -make[2]: Entering directory '[...]/hurd/master.build/i686-unknown-gnu0.6/libitm' +make[2]: Entering directory '[...]/hurd/master.build/i686-unknown-gnu0.7/libitm' Making check in testsuite -make[3]: Entering directory '[...]/hurd/master.build/i686-unknown-gnu0.6/libitm/testsuite' +make[3]: Entering directory '[...]/hurd/master.build/i686-unknown-gnu0.7/libitm/testsuite' make check-DEJAGNU -make[4]: Entering directory '[...]/hurd/master.build/i686-unknown-gnu0.6/libitm/testsuite' +make[4]: Entering directory '[...]/hurd/master.build/i686-unknown-gnu0.7/libitm/testsuite' Making a new site.exp file... srcdir='../../../../master/libitm/testsuite'; export srcdir; \ EXPECT=expect; export EXPECT; \ @@ -1763,8 +1761,8 @@ if /bin/dash -c "$runtest --version" > /dev/null 2>&1; then \ else echo "WARNING: could not find \`runtest'" 1>&2; :;\ fi; \ exit $exit_status -Test Run By thomas on Wed Apr 20 10:33:46 2016 -Native configuration is i686-unknown-gnu0.6 +Test Run By thomas on Fri May 20 03:00:14 2016 +Native configuration is i686-unknown-gnu0.7 === libitm tests === @@ -1788,21 +1786,21 @@ Running ../../../../master/libitm/testsuite/libitm.c++/c++.exp ... # of unsupported tests 1 Makefile:282: recipe for target 'check-DEJAGNU' failed make[4]: *** [check-DEJAGNU] Error 1 -make[4]: Leaving directory '[...]/hurd/master.build/i686-unknown-gnu0.6/libitm/testsuite' +make[4]: Leaving directory '[...]/hurd/master.build/i686-unknown-gnu0.7/libitm/testsuite' Makefile:326: recipe for target 'check-am' failed make[3]: *** [check-am] Error 2 make[3]: Target 'check' not remade because of errors. -make[3]: Leaving directory '[...]/hurd/master.build/i686-unknown-gnu0.6/libitm/testsuite' -make[3]: Entering directory '[...]/hurd/master.build/i686-unknown-gnu0.6/libitm' +make[3]: Leaving directory '[...]/hurd/master.build/i686-unknown-gnu0.7/libitm/testsuite' +make[3]: Entering directory '[...]/hurd/master.build/i686-unknown-gnu0.7/libitm' make DO=all multi-do # make -make[4]: Entering directory '[...]/hurd/master.build/i686-unknown-gnu0.6/libitm' +make[4]: Entering directory '[...]/hurd/master.build/i686-unknown-gnu0.7/libitm' if [ -z "" ]; then \ true; \ else \ rootpre=`${PWDCMD-pwd}`/; export rootpre; \ srcrootpre=`cd ../../../master/libitm; ${PWDCMD-pwd}`/; export srcrootpre; \ lib=`echo "${rootpre}" | sed -e 's,^.*/\([^/][^/]*\)/$,\1,'`; \ - compiler="[...]/hurd/master.build/./gcc/xgcc -B[...]/hurd/master.build/./gcc/ -B[...]/hurd/master.build.install/i686-unknown-gnu0.6/bin/ -B[...]/hurd/master.build.install/i686-unknown-gnu0.6/lib/ -isystem [...]/hurd/master.build.install/i686-unknown-gnu0.6/include -isystem [...]/hurd/master.build.install/i686-unknown-gnu0.6/sys-include "; \ + compiler="[...]/hurd/master.build/./gcc/xgcc -B[...]/hurd/master.build/./gcc/ -B[...]/hurd/master.build.install/i686-unknown-gnu0.7/bin/ -B[...]/hurd/master.build.install/i686-unknown-gnu0.7/lib/ -isystem [...]/hurd/master.build.install/i686-unknown-gnu0.7/include -isystem [...]/hurd/master.build.install/i686-unknown-gnu0.7/sys-include "; \ for i in `${compiler} --print-multi-lib 2>/dev/null`; do \ dir=`echo $i | sed -e 's/;.*$//'`; \ if [ "${dir}" = "." ]; then \ @@ -1840,19 +1838,19 @@ else \ fi; \ done; \ fi -make[4]: Leaving directory '[...]/hurd/master.build/i686-unknown-gnu0.6/libitm' -make[3]: Leaving directory '[...]/hurd/master.build/i686-unknown-gnu0.6/libitm' +make[4]: Leaving directory '[...]/hurd/master.build/i686-unknown-gnu0.7/libitm' +make[3]: Leaving directory '[...]/hurd/master.build/i686-unknown-gnu0.7/libitm' Makefile:723: recipe for target 'check-recursive' failed make[2]: *** [check-recursive] Error 1 make[2]: Target 'check' not remade because of errors. -make[2]: Leaving directory '[...]/hurd/master.build/i686-unknown-gnu0.6/libitm' +make[2]: Leaving directory '[...]/hurd/master.build/i686-unknown-gnu0.7/libitm' Makefile:20862: recipe for target 'check-target-libitm' failed make[1]: *** [check-target-libitm] Error 2 -make[2]: Entering directory '[...]/hurd/master.build/i686-unknown-gnu0.6/libatomic' +make[2]: Entering directory '[...]/hurd/master.build/i686-unknown-gnu0.7/libatomic' Making check in testsuite -make[3]: Entering directory '[...]/hurd/master.build/i686-unknown-gnu0.6/libatomic/testsuite' +make[3]: Entering directory '[...]/hurd/master.build/i686-unknown-gnu0.7/libatomic/testsuite' make check-DEJAGNU -make[4]: Entering directory '[...]/hurd/master.build/i686-unknown-gnu0.6/libatomic/testsuite' +make[4]: Entering directory '[...]/hurd/master.build/i686-unknown-gnu0.7/libatomic/testsuite' Making a new site.exp file... srcdir='../../../../master/libatomic/testsuite'; export srcdir; \ EXPECT=expect; export EXPECT; \ @@ -1865,8 +1863,8 @@ if /bin/dash -c "$runtest --version" > /dev/null 2>&1; then \ else echo "WARNING: could not find \`runtest'" 1>&2; :;\ fi; \ exit $exit_status -Test Run By thomas on Wed Apr 20 10:39:01 2016 -Native configuration is i686-unknown-gnu0.6 +Test Run By thomas on Fri May 20 03:05:29 2016 +Native configuration is i686-unknown-gnu0.7 === libatomic tests === @@ -1883,18 +1881,18 @@ Running ../../../../master/libatomic/testsuite/libatomic.c/c.exp ... # of expected passes 44 # of unsupported tests 5 -make[4]: Leaving directory '[...]/hurd/master.build/i686-unknown-gnu0.6/libatomic/testsuite' -make[3]: Leaving directory '[...]/hurd/master.build/i686-unknown-gnu0.6/libatomic/testsuite' -make[3]: Entering directory '[...]/hurd/master.build/i686-unknown-gnu0.6/libatomic' +make[4]: Leaving directory '[...]/hurd/master.build/i686-unknown-gnu0.7/libatomic/testsuite' +make[3]: Leaving directory '[...]/hurd/master.build/i686-unknown-gnu0.7/libatomic/testsuite' +make[3]: Entering directory '[...]/hurd/master.build/i686-unknown-gnu0.7/libatomic' make DO=all multi-do # make -make[4]: Entering directory '[...]/hurd/master.build/i686-unknown-gnu0.6/libatomic' +make[4]: Entering directory '[...]/hurd/master.build/i686-unknown-gnu0.7/libatomic' if [ -z "" ]; then \ true; \ else \ rootpre=`${PWDCMD-pwd}`/; export rootpre; \ srcrootpre=`cd ../../../master/libatomic; ${PWDCMD-pwd}`/; export srcrootpre; \ lib=`echo "${rootpre}" | sed -e 's,^.*/\([^/][^/]*\)/$,\1,'`; \ - compiler="[...]/hurd/master.build/./gcc/xgcc -B[...]/hurd/master.build/./gcc/ -B[...]/hurd/master.build.install/i686-unknown-gnu0.6/bin/ -B[...]/hurd/master.build.install/i686-unknown-gnu0.6/lib/ -isystem [...]/hurd/master.build.install/i686-unknown-gnu0.6/include -isystem [...]/hurd/master.build.install/i686-unknown-gnu0.6/sys-include "; \ + compiler="[...]/hurd/master.build/./gcc/xgcc -B[...]/hurd/master.build/./gcc/ -B[...]/hurd/master.build.install/i686-unknown-gnu0.7/bin/ -B[...]/hurd/master.build.install/i686-unknown-gnu0.7/lib/ -isystem [...]/hurd/master.build.install/i686-unknown-gnu0.7/include -isystem [...]/hurd/master.build.install/i686-unknown-gnu0.7/sys-include "; \ for i in `${compiler} --print-multi-lib 2>/dev/null`; do \ dir=`echo $i | sed -e 's/;.*$//'`; \ if [ "${dir}" = "." ]; then \ @@ -1932,9 +1930,9 @@ else \ fi; \ done; \ fi -make[4]: Leaving directory '[...]/hurd/master.build/i686-unknown-gnu0.6/libatomic' -make[3]: Leaving directory '[...]/hurd/master.build/i686-unknown-gnu0.6/libatomic' -make[2]: Leaving directory '[...]/hurd/master.build/i686-unknown-gnu0.6/libatomic' +make[4]: Leaving directory '[...]/hurd/master.build/i686-unknown-gnu0.7/libatomic' +make[3]: Leaving directory '[...]/hurd/master.build/i686-unknown-gnu0.7/libatomic' +make[2]: Leaving directory '[...]/hurd/master.build/i686-unknown-gnu0.7/libatomic' make[1]: Target 'check-target' not remade because of errors. make[1]: Leaving directory '[...]/hurd/master.build' Makefile:2266: recipe for target 'do-check' failed |